Peptide,PTM,ModifiedAA,ModifiedPosition,PeptideUniqueToGene,ExperimentDesc,ExpID,PubmedID,ScoreType,IdentScore,LocProb,Log2FChange,PQ-val,QuantSig,PEP,MassErrorPPM
FLTQSGTFKDGDLRVNK,ph,T,25,false,"MAPK Arabidopsis substrates",45,23172892,"MaxQuant Score",77.4680000,,,,,,
FLTQSGTFKDGDLR,ph,S,27,false,"Ethylene-regulated phosphorylation ein2 mutant",30,19253305,"MASCOT Score",40.7407000,,,,,,6.2364597
FLTQSGTFKDGDLR,ph,S,27,false,"MAPK Arabidopsis substrates",45,23172892,"MaxQuant Score",122.3300000,,,,,,
TQSGTFKDGDLR,ph,S,27,false,"Tissue atlas Arabidopsis - ProteomicsDB",114,32188942,"MaxQuant score",87.8630000,0.9948010,,,,0.00094331399304792,
FLTQSGTFK,ph,S,27,false,"atm and atr DNA damage response",88,25561503,"MASCOT Score",38.0000000,0.8910000,,,,,-0.6300000
FLTQSGTFK,ph,S,27,false,"Tissue atlas Arabidopsis - ProteomicsDB",114,32188942,"MaxQuant score",163.6600000,0.9827450,,,,3.3892800274771E-5,
FLTQSGTFKDGDLRVNK,ph,T,29,false,"MAPK Arabidopsis substrates",45,23172892,"MaxQuant Score",98.1690000,,,,,,
FLTQSGTFKDGDLR,ph,T,29,false,"Large-scale phosphorylation discovery",44,23111157,XCorr,2.8670000,,,,,,
FLTQSGTFKDGDLR,ph,T,29,false,"MAPK Arabidopsis substrates",45,23172892,"MaxQuant Score",151.5600000,,,,,,
FLTQSGTFKDGDLR,ph,T,29,false,"PAMP-triggered phosphorylation",48,24601666,"MASCOT Score",59.1600000,,,,,,
FLTQSGTFKDGDLR,ph,T,29,false,"srk2dei ABA signaling phopshoproteomics",83,23572148,"MASCOT Score",89.0000000,,,,,,-0.0009000
FLTQSGTFKDGDLR,ph,T,29,false,"atm and atr DNA damage response",88,25561503,"MASCOT Score",65.0000000,1.0000000,,,,,-1.1700000
FLTQSGTFKDGDLR,ph,T,29,false,"Protein sumoylation and phosphorylation cross-talk",97,28419593,,,,,,,,
FLTQSGTFKDGDLR,ph,T,29,false,"TOR Kinase and ABA Receptor",100,29290610,XCorr,2.1306720,0.9188000,,,,0.026860000565648,
FLTQSGTFKDGDLR,ph,T,29,false,"Phospho cell culture sucrose/TOR",109,30833711,,,0.9992090,,,,,
FLTQSGTFKDGDLR,ph,T,29,false,"Tissue atlas Arabidopsis - ProteomicsDB",114,32188942,"MaxQuant score",284.7400000,0.9999920,,,,0,
FLTQSGTFKDGDLR,ph,T,29,false,"Touch-induced phosphorylation: 40s touch vs untouc",136,30291188,"MASCOT score",87.0900000,,3.9240787,0.0000007,YES,,3.1847642
FLTQSGTFK,ph,T,29,false,"Phosphoproteome iron-deficient Arabidopsis roots",41,22438062,"MASCOT Score",43.7500000,,,,,,
FLTQSGTFK,ph,T,29,false,"srk2dei ABA signaling phopshoproteomics",83,23572148,"MASCOT Score",44.0000000,,,,,,-0.0008000
FLTQSGTFK,ph,T,29,false,"atm and atr DNA damage response",88,25561503,"MASCOT Score",46.0000000,1.0000000,,,,,-0.9800000
FLTQSGTFK,ph,T,29,false,"TOR Kinase and ABA Receptor",100,29290610,XCorr,2.9657404,0.9933000,,,,0.0042240000329912,
FLTQSGTFK,ph,T,29,false,"Col-0 callus - FC Col-0 vs. Col-0 Xray",111a,31410901,,35.2900000,,0.9492726,0.0000000,NO,,-0.0856083
FLTQSGTFK,ph,T,29,false,"Col-0 X-ray callus - FC Col-0 vs. Col-0 Xray",111b,31410901,,35.2900000,,0.9492726,0.0000000,NO,,-0.0856083
FLTQSGTFK,ph,T,29,false,"atm callus - FC atm vs. atm Xray",111c,31410901,,35.2900000,,0.3328070,0.0000000,NO,,-0.0856083
FLTQSGTFK,ph,T,29,false,"atm-3 X-ray callus - FC atm vs. atm Xray",111d,31410901,,35.2900000,,0.3328070,0.0000000,NO,,-0.0856083
VIQLNTEESTCR,sno,C,108,true,"hot5-4 / wildtype, FAT-switch S-nitrosoproteome",169,37277371,,,,0.0774820,0.3743749,NO,,
