Peptide,PTM,ModifiedAA,ModifiedPosition,PeptideUniqueToGene,ExperimentDesc,ExpID,PubmedID,ScoreType,IdentScore,LocProb,Log2FChange,PQ-val,QuantSig,PEP,MassErrorPPM
GNGNSTETK,myr,G,2,true,"Characterization plant N-terminal acetylation",6,22223895,"MASCOT Score",43.7900000,,,,,,
GNGNSTETK,myr,G,2,true,"N-Terminal Myristoylated Proteins",102,29453228,,,,,,,,
RLSRPGSGSVSGLASQR,ph,S,31,true,"atm and atr DNA damage response",88,25561503,"MASCOT Score",57.0000000,0.9850000,,,,,0.0900000
RLSRPGSGSVSGLASQR,ph,S,31,true,"TOR Kinase and ABA Receptor",100,29290610,XCorr,2.7330816,0.7791000,,,,0.0047459998168051,
LSRPGSGSVSGLASQR,ph,S,31,true,"srk2dei ABA signaling phopshoproteomics",83,23572148,"MASCOT Score",53.0000000,,,,,,0.0000000
LSRPGSGSVSGLASQR,ph,S,31,true,"LAXIC - ABA stress",84a,23660473,XCorr,3.1000000,0.9650000,,,,9.8199996045878E-7,
RLSRPGSGSVSGLASQR,ph,S,35,true,"PAMP-triggered phosphorylation",48,24601666,"MASCOT Score",35.3900000,,,,,,
RLSRPGSGSVSGLASQR,ph,S,35,true,"atm and atr DNA damage response",88,25561503,"MASCOT Score",41.0000000,1.0000000,,,,,-0.1700000
LSRPGSGSVSGLASQR,ph,S,35,true,"PAMP-triggered phosphorylation",48,24601666,"MASCOT Score",65.8800000,,,,,,
LSRPGSGSVSGLASQR,ph,S,35,true,"srk2dei ABA signaling phopshoproteomics",83,23572148,"MASCOT Score",59.0000000,,,,,,-0.0002000
LSRPGSGSVSGLASQR,ph,S,35,true,"LAXIC - mannitol vs control",84b,23660473,XCorr,3.8900000,0.8970000,,,,0.0010191999608651,
LSRPGSGSVSGLASQR,ph,S,35,true,"atm and atr DNA damage response",88,25561503,"MASCOT Score",74.0000000,0.9890000,,,,,-0.7200000
LSRPGSGSVSGLASQR,ph,S,35,true,"Phospho cell culture sucrose/TOR",109,30833711,,,0.9822650,,,,,
PGSGSVSGLASQR,ph,S,35,true,"atm and atr DNA damage response",88,25561503,"MASCOT Score",81.0000000,0.9950000,,,,,-0.3500000
PGSGSVSGLASQR,ph,S,35,true,"Tissue atlas Arabidopsis - ProteomicsDB",114,32188942,"MaxQuant score",222.5600000,0.9997960,,,,7.4198753685999E-42,
RRLSRPGSGSVSGLASQR,ph,S,37,true,"TOR Kinase and ABA Receptor",100,29290610,XCorr,2.9351339,0.8707000,,,,0.0013289999915287,
RLSRPGSGSVSGLASQR,ph,S,37,true,"atm and atr DNA damage response",88,25561503,"MASCOT Score",20.0000000,1.0000000,,,,,0.7300000
LSRPGSGSVSGLASQR,ph,S,37,true,"PAMP-triggered phosphorylation",48,24601666,"MASCOT Score",32.3000000,,,,,,
LSRPGSGSVSGLASQR,ph,S,37,true,"srk2dei ABA signaling phopshoproteomics",83,23572148,"MASCOT Score",45.0000000,,,,,,-0.0009000
LSRPGSGSVSGLASQR,ph,S,37,true,"LAXIC - mannitol vs control",84b,23660473,XCorr,3.8900000,0.8970000,,,,0.0010191999608651,
LSRPGSGSVSGLASQR,ph,S,37,true,"atm and atr DNA damage response",88,25561503,"MASCOT Score",69.0000000,0.9940000,,,,,-0.7000000
PGSGSVSGLASQR,ph,S,37,true,"Tissue atlas Arabidopsis - ProteomicsDB",114,32188942,"MaxQuant score",128.2200000,0.9966900,,,,2.7233300059493E-8,
LSRPGSGSVSGLASQR,ph,S,39,true,"PAMP-triggered phosphorylation",48,24601666,"MASCOT Score",25.6800000,,,,,,
LSRPGSGSVSGLASQR,ph,S,39,true,"Tissue atlas Arabidopsis - ProteomicsDB",114,32188942,"MaxQuant score",108.1800000,0.8513820,,,,5.0090699232896E-7,
LSRPGSGSVSGLASQR,ph,S,43,true,"TOR Kinase and ABA Receptor",100,29290610,XCorr,4.3273115,1.0000000,,,,0.00010140000085812,
LSRPGSGSVSGLASQR,ph,S,43,true,"Tissue atlas Arabidopsis - ProteomicsDB",114,32188942,"MaxQuant score",138.1900000,0.9999990,,,,2.4479399144184E-5,
