Peptide,PTM,ModifiedAA,ModifiedPosition,PeptideUniqueToGene,ExperimentDesc,ExpID,PubmedID,ScoreType,IdentScore,LocProb,Log2FChange,PQ-val,QuantSig,PEP,MassErrorPPM
ATFNSFRK,ph,S,6,true,"atm and atr DNA damage response",88,25561503,"MASCOT Score",33.0000000,1.0000000,,,,,0.3200000
ATFNSFRK,ph,S,6,true,"Tissue atlas Arabidopsis - ProteomicsDB",114,32188942,"MaxQuant score",121.4100000,1.0000000,,,,0.0024260699283332,
DSTTVSIAK,ph,S,21,true,"Tissue atlas Arabidopsis - ProteomicsDB",114,32188942,"MaxQuant score",67.9300000,0.9926850,,,,0.012512300163507,
IFSATSVVQPR,ph,S,57,true,"atm and atr DNA damage response",88,25561503,"MASCOT Score",46.0000000,0.9990000,,,,,1.6900000
IFSATSVVQPR,ph,S,57,true,"Tissue atlas Arabidopsis - ProteomicsDB",114,32188942,"MaxQuant score",181.6600000,0.9999980,,,,4.3243800061004E-14,
NVDFNASQTYR,ph,S,182,true,"atm and atr DNA damage response",88,25561503,"MASCOT Score",46.0000000,1.0000000,,,,,1.2500000
NVDFNASQTYR,ph,S,182,true,"Tissue atlas Arabidopsis - ProteomicsDB",114,32188942,"MaxQuant score",139.4600000,0.9889070,,,,9.7651195574144E-7,
ENSEGDQPLIEEEEEDQEK,ph,S,361,true,"TOR Kinase and ABA Receptor",100,29290610,XCorr,4.9217272,1.0000000,,,,2.0610000319721E-6,
ENSEGDQPLIEEEEEDQEK,ph,S,361,true,"Tissue atlas Arabidopsis - ProteomicsDB",114,32188942,"MaxQuant score",265.4200000,1.0000000,,,,0,
