Peptide,PTM,ModifiedAA,ModifiedPosition,PeptideUniqueToGene,ExperimentDesc,ExpID,PubmedID,ScoreType,IdentScore,LocProb,Log2FChange,PQ-val,QuantSig,PEP,MassErrorPPM
GKVKGKHRLDKYYRLAKE,nt,G,2,true,"Arabidopsis translation initiation landscape - NT",167b,35069635,,,,,,,,
VVDVLGGSKQK,ph,S,235,true,"Tissue atlas Arabidopsis - ProteomicsDB",114,32188942,"MaxQuant score",105.1700000,1.0000000,,,,0.00038218099507503,
DGYEDGESILRR,ph,S,249,true,"Tissue atlas Arabidopsis - ProteomicsDB",114,32188942,"MaxQuant score",76.8200000,1.0000000,,,,0.00040887200157158,
YMVKKEGSAK,ph,Y,472,true,"Conserved plant phosphoproteome - Arabidopsis",61a,20466843,"MASCOT Score",23.0000000,1.0000000,,,,,
YMVKKEGSAK,ph,Y,472,true,"srk2dei ABA signaling phopshoproteomics",83,23572148,"MASCOT Score",20.0000000,,,,,,-0.0017000
YMVKKEGSAK,ph,S,479,true,"Conserved plant phosphoproteome - Arabidopsis",61a,20466843,"MASCOT Score",23.0000000,1.0000000,,,,,
YMVKKEGSAK,ph,S,479,true,"srk2dei ABA signaling phopshoproteomics",83,23572148,"MASCOT Score",20.0000000,,,,,,-0.0017000
IDYDSDMNEEKDEANPLVVPLDDGVVQTK,ph,Y,507,true,"SnRK2 protein kinase substrates",85,23776212,XCorr,4.7265491,0.8480000,,,,3.8891098491872E-15,
IDYDSDMNEEKDEANPLVVPLDDGVVQTK,ph,S,509,true,"Arabidopsis root NAA phosphoproteome",18a,27643528,"MaxQuant Score",79.0690000,0.8090000,,,,1.3890000261085E-8,-0.0020000
IDYDSDMNEEKDEANPLVVPLDDGVVQTK,ph,S,509,true,"SnRK2 protein kinase substrates",85,23776212,XCorr,3.1569934,0.9210000,,,,4.2146599298576E-5,
IDYDSDMNEEKDEANPLVVPLDDGVVQTK,ph,S,509,true,"TOR Kinase and ABA Receptor",100,29290610,XCorr,4.8017359,0.8406000,,,,0.00068990001454949,
LEEGDGDEEMKIDYDSDMNEEK,ph,S,509,true,"Chloroplast kinase substrates",60,19376835,"MASCOT Score",67.5300000,,,,,,-0.9807450
IDYDSDMNEEK,ph,S,509,true,"srk2dei ABA signaling phopshoproteomics",83,23572148,"MASCOT Score",66.0000000,,,,,,0.0001000
IDYDSDMNEEK,ph,S,509,true,"TOR Kinase and ABA Receptor",100,29290610,XCorr,4.6745210,0.9998000,,,,1.6489999552505E-6,
IDYDSDMNEEK,ph,S,509,true,"Tissue atlas Arabidopsis - ProteomicsDB",114,32188942,"MaxQuant score",201.0900000,1.0000000,,,,0,
EEISNQWFSQNIFAEAVEEGDLGKDDSEDEIANKK,ph,S,560,true,"Arabidopsis root NAA phosphoproteome",18a,27643528,"MaxQuant Score",99.1650000,1.0000000,,,,1.7619999697575E-13,-0.0780000
EEISNQWFSQNIFAEAVEEGDLGKDDSEDEIANK,ph,S,560,true,"SnRK2 protein kinase substrates",85,23776212,XCorr,4.9544935,1.0000000,,,,6.5112401147899E-13,
DDSEDEIANKK,ph,S,560,true,"TOR Kinase and ABA Receptor",100,29290610,XCorr,2.9256625,1.0000000,,,,0.00020840000070166,
DDSEDEIANK,ph,S,560,true,"TOR Kinase and ABA Receptor",100,29290610,XCorr,4.0684061,1.0000000,,,,0.00013899999612477,
DDSEDEIANK,ph,S,560,true,"Tissue atlas Arabidopsis - ProteomicsDB",114,32188942,"MaxQuant score",298.7000000,1.0000000,,,,0,
ASVLSDQSLPNSSK,ph,S,590,true,"Tissue atlas Arabidopsis - ProteomicsDB",114,32188942,"MaxQuant score",147.5100000,0.9999930,,,,2.0616299466203E-12,
KEDEFEVVPAPATDSDSDSSSEDDVHTK,ph,T,612,true,"SnRK2 protein kinase substrates",85,23776212,XCorr,4.6219020,0.9880000,,,,0.00047247798647732,
AEILACAK,sno,C,633,true,"hot5-4 / wildtype, FAT-switch S-nitrosoproteome",169,37277371,,,,0.7761518,0.0002022,YES,,
AQFKEINAR,nt,A,689,true,"Arabidopsis translation initiation landscape - NT",167b,35069635,,,,,,,,
PAKKVAEAKAR,ub,K,706,true,"Arabidopsis ubiquitination COFRADIC",40,26744219,"MaxQuant Score",81.9200000,1.0000000,,,,0.00035180000122637,-0.2540000
