Peptide,PTM,ModifiedAA,ModifiedPosition,PeptideUniqueToGene,ExperimentDesc,ExpID,PubmedID,ScoreType,IdentScore,LocProb,Log2FChange,PQ-val,QuantSig,PEP,MassErrorPPM
GPAGRGGMK,me1,R,71,true,"Arabidopsis protein methylome",123,31809900,"MaxQuant Score",55.3700000,1.0000000,,,,0.0023532500490546,-0.3730200
GKEDALVTKNLVPGEAVYNEKR,ac,K,103,false,"Quantitative Acetylproteomics",101,29440448,,,,,,,,
GKEDALVTKNLVPGEAVYNEK,ac,K,103,false,"Quantitative Acetylproteomics",101,29440448,,,,,,,,
NLVPGEAVYNEKR,ac,K,115,false,"Quantitative Acetylproteomics",101,29440448,,,,,,,,
ISVQNEDGTKTEYR,ub,K,126,true,"Arabidopsis ubiquitination COFRADIC",40,26744219,"MaxQuant Score",81.6320000,1.0000000,,,,4.1540001802787E-6,-0.5720000
DLVNMAKKR,ub,K,201,false,"Arabidopsis ubiquitination COFRADIC",40,26744219,"MaxQuant Score",77.7320000,0.9470000,,,,0.003000000026077,0.3080000
SDVAQPDQARIL,nt,S,230,false,"Arabidopsis translation initiation landscape - NT",167b,35069635,,,,,,,,
ANCIDSTVPAEAVFQTEVK,sno,C,263,true,"hot5-4 / wildtype, FAT-switch S-nitrosoproteome",169,37277371,,,,0.5421793,0.0149422,NO,,
QQEQFKPAEQVTLEPFER,nt,Q,282,false,"Arabidopsis translation initiation landscape - NT",167b,35069635,,,,,,,,
DHACVVGGYR,so,C,303,false,"Arabidopsis S-sulfenylation chemoproteomics",108,31578252,"pFind PSM Score",0.0173025,,1.3799000,,,,-1.1474462
