Peptide,PTM,ModifiedAA,ModifiedPosition,PeptideUniqueToGene,ExperimentDesc,ExpID,PubmedID,ScoreType,IdentScore,LocProb,Log2FChange,PQ-val,QuantSig,PEP,MassErrorPPM
MKPVFCGNFEYDAR,nta,M,1,false,"FtsH12 N-terminome: WT / FtsH12 knockdown miRNA",118,33216923,"MaxQuant score",84.5070000,,-0.6776655,0.0161193,YES,0,
DDDARGNGHSPER,ph,S,178,true,"atm and atr DNA damage response",88,25561503,"MASCOT Score",32.0000000,1.0000000,,,,,-0.6700000
DDDARGNGHSPER,ph,S,178,true,"Tissue atlas Arabidopsis - ProteomicsDB",114,32188942,"MaxQuant score",41.3670000,1.0000000,,,,0.016179200261831,
RRSPSPYK,ph,S,193,false,"TOR Kinase and ABA Receptor",100,29290610,XCorr,2.7679369,1.0000000,,,,0.0020870000589639,
SPSPYKR,ph,S,193,false,"Phospho cell culture sucrose/TOR",109,30833711,,,0.9919570,,,,,
RERGSPDYGR,ph,S,203,false,"TOR Kinase and ABA Receptor",100,29290610,XCorr,2.4529541,1.0000000,,,,0.0024979999288917,
ERGSPDYGR,ph,S,203,false,"Ethylene-regulated phosphorylation ein2 mutant",30,19253305,"MASCOT Score",45.0980000,,,,,,14.1173680
ERGSPDYGR,ph,S,203,false,"Tyrosine phosphorylation in Arabidopsis",59,18463617,"MASCOT Score",31.0000000,,,,,,-0.7172065
ERGSPDYGR,ph,S,203,false,"srk2dei ABA signaling phopshoproteomics",83,23572148,"MASCOT Score",21.0000000,,,,,,0.0003000
ERGSPDYGR,ph,S,203,false,"atm and atr DNA damage response",88,25561503,"MASCOT Score",36.0000000,1.0000000,,,,,-0.3500000
ERGSPDYGR,ph,S,203,false,"TOR Kinase and ABA Receptor",100,29290610,XCorr,3.2772512,1.0000000,,,,0.00011549999908311,
ERGSPDYGR,ph,S,203,false,"Phospho cell culture sucrose/TOR",109,30833711,,,1.0000000,,,,,
ERGSPDYGR,ph,S,203,false,"Col-0 callus - FC Col-0 vs. Col-0 Xray",111a,31410901,,35.9000000,,-1.9636525,0.0000000,NO,,-0.1719069
ERGSPDYGR,ph,S,203,false,"Col-0 X-ray callus - FC Col-0 vs. Col-0 Xray",111b,31410901,,35.9000000,,-1.9636525,0.0000000,NO,,-0.1719069
ERGSPDYGR,ph,S,203,false,"atm callus - FC atm vs. atm Xray",111c,31410901,,35.9000000,,0.9366190,0.0000000,NO,,-0.1719069
ERGSPDYGR,ph,S,203,false,"atm-3 X-ray callus - FC atm vs. atm Xray",111d,31410901,,35.9000000,,0.9366190,0.0000000,NO,,-0.1719069
ERGSPDYGR,ph,S,203,false,"Tissue atlas Arabidopsis - ProteomicsDB",114,32188942,"MaxQuant score",221.2400000,1.0000000,,,,4.3741898587842E-23,
GASPVAAYRK,ph,S,211,true,"STN8 phosphoproteome",38,21768351,"MASCOT Score",52.7300000,,,,,,0.6057200
GASPVAAYRK,ph,S,211,true,"Chloroplast kinase substrates",60,19376835,"MASCOT Score",45.6700000,,,,,,0.3149530
GASPVAAYRK,ph,S,211,true,"srk2dei ABA signaling phopshoproteomics",83,23572148,"MASCOT Score",25.0000000,,,,,,0.0002000
GASPVAAYRK,ph,S,211,true,"Tissue atlas Arabidopsis - ProteomicsDB",114,32188942,"MaxQuant score",109.0200000,1.0000000,,,,0.00055070902453735,
GASPVAAYR,ph,S,211,true,"Arabidopsis root NAA phosphoproteome",18a,27643528,"MaxQuant Score",47.3020000,1.0000000,,,,0.0020000000949949,-0.1670000
GASPVAAYR,ph,S,211,true,"Immuno-dot blot phosphorylation",31,19341826,"MASCOT Score",35.5500000,,,,,,
GASPVAAYR,ph,S,211,true,"STN8 phosphoproteome",38,21768351,"MASCOT Score",82.0500000,,,,,,0.1271210
GASPVAAYR,ph,S,211,true,"Pollen phosphoproteome Arabidopsis",43,22631563,"MASCOT Score",53.9000000,,,,,,
GASPVAAYR,ph,S,211,true,"Phosphoproteome ethylene-regulated time response",46,24043427,"MASCOT Score",50.7500000,,,,,,-18.5060000
GASPVAAYR,ph,S,211,true,"Tyrosine phosphorylation in Arabidopsis",59,18463617,"MASCOT Score",43.0000000,,,,,,-0.3091422
GASPVAAYR,ph,S,211,true,"Chloroplast kinase substrates",60,19376835,"MASCOT Score",67.1300000,,,,,,0.6824240
GASPVAAYR,ph,S,211,true,"srk2dei ABA signaling phopshoproteomics",83,23572148,"MASCOT Score",73.0000000,,,,,,-0.0001000
GASPVAAYR,ph,S,211,true,"LAXIC - ABA stress",84a,23660473,XCorr,2.4000000,1.0000000,,,,0.008523560129106,
GASPVAAYR,ph,S,211,true,"LAXIC - mannitol vs control",84b,23660473,XCorr,2.5300000,1.0000000,,,,0.00053576502250507,
GASPVAAYR,ph,S,211,true,"SnRK2 protein kinase substrates",85,23776212,XCorr,2.3119631,1.0000000,,,,0.037623599171638,
GASPVAAYR,ph,S,211,true,"atm and atr DNA damage response",88,25561503,"MASCOT Score",59.0000000,1.0000000,,,,,0.0600000
GASPVAAYR,ph,S,211,true,"Lateral root-induction - NAA vs control",106,23328941,"MASCOT Score",24.0000000,,,,,,
GASPVAAYR,ph,S,211,true,"Phospho cell culture sucrose/TOR",109,30833711,,,0.9999940,,,,,
GASPVAAYR,ph,S,211,true,"Col-0 callus - FC Col-0 vs. Col-0 Xray",111a,31410901,,52.2800000,,-0.4951764,0.0000000,NO,,0.1435808
GASPVAAYR,ph,S,211,true,"Col-0 X-ray callus - FC Col-0 vs. Col-0 Xray",111b,31410901,,52.2800000,,-0.4951764,0.0000000,NO,,0.1435808
GASPVAAYR,ph,S,211,true,"atm callus - FC atm vs. atm Xray",111c,31410901,,52.2800000,,-0.9815760,0.0000000,NO,,0.1435808
GASPVAAYR,ph,S,211,true,"atm-3 X-ray callus - FC atm vs. atm Xray",111d,31410901,,52.2800000,,-0.9815760,0.0000000,NO,,0.1435808
ERTSPDYGR,ph,T,221,false,"Tyrosine phosphorylation in Arabidopsis",59,18463617,"MASCOT Score",29.0000000,,,,,,-0.7762200
ERTSPDYGR,ph,T,221,false,"atm and atr DNA damage response",88,25561503,"MASCOT Score",30.0000000,1.0000000,,,,,-0.5900000
ERTSPDYGR,ph,T,221,false,"Phospho cell culture sucrose/TOR",109,30833711,,,0.8701410,,,,,
ERTSPDYGR,ph,T,221,false,"Tissue atlas Arabidopsis - ProteomicsDB",114,32188942,"MaxQuant score",100.0700000,0.9477670,,,,0.00053456099703908,
ERTSPDYGR,ph,S,222,false,"Arabidopsis root NAA phosphoproteome",18a,27643528,"MaxQuant Score",45.6530000,0.7770000,,,,0.0040000001899898,-0.2090000
ERTSPDYGR,ph,S,222,false,"Tyrosine phosphorylation in Arabidopsis",59,18463617,"MASCOT Score",23.0000000,,,,,,-0.5174799
ERTSPDYGR,ph,S,222,false,"SnRK2 protein kinase substrates",85,23776212,XCorr,2.5353029,0.9150000,,,,0.00049838400445879,
ERTSPDYGR,ph,S,222,false,"atm and atr DNA damage response",88,25561503,"MASCOT Score",30.0000000,1.0000000,,,,,-0.5900000
ERTSPDYGR,ph,S,222,false,"TOR Kinase and ABA Receptor",100,29290610,XCorr,3.5333486,0.9427000,,,,7.6769996667281E-5,
ERTSPDYGR,ph,S,222,false,"Phospho cell culture sucrose/TOR",109,30833711,,,0.9843020,,,,,
ERTSPDYGR,ph,S,222,false,"Col-0 callus - FC Col-0 vs. Col-0 Xray",111a,31410901,,58.0700000,,-2.2507048,0.0000000,NO,,-0.1028262
ERTSPDYGR,ph,S,222,false,"Col-0 X-ray callus - FC Col-0 vs. Col-0 Xray",111b,31410901,,58.0700000,,-2.2507048,0.0000000,NO,,-0.1028262
ERTSPDYGR,ph,S,222,false,"atm callus - FC atm vs. atm Xray",111c,31410901,,58.0700000,,5.0873645,0.0000000,NO,,-0.1028262
ERTSPDYGR,ph,S,222,false,"atm-3 X-ray callus - FC atm vs. atm Xray",111d,31410901,,58.0700000,,5.0873645,0.0000000,NO,,-0.1028262
ERTSPDYGR,ph,S,222,false,"Tissue atlas Arabidopsis - ProteomicsDB",114,32188942,"MaxQuant score",205.1200000,0.9997870,,,,1.378020008317E-15,
TSPDYGR,ph,S,222,false,"SnRK2 protein kinase substrates",85,23776212,XCorr,2.0357101,0.9630000,,,,0.043352898210287,
RRSPSPYK,ph,S,230,false,"TOR Kinase and ABA Receptor",100,29290610,XCorr,2.7679369,1.0000000,,,,0.0020870000589639,
RGSPEYGRDR,ph,S,241,true,"STN8 phosphoproteome",38,21768351,"MASCOT Score",43.4800000,,,,,,1.7779300
RGSPEYGRDR,ph,S,241,true,"TOR Kinase and ABA Receptor",100,29290610,XCorr,2.4462640,0.9994000,,,,0.010089999996126,
RGSPEYGR,ph,S,241,true,"STN8 phosphoproteome",38,21768351,"MASCOT Score",52.4000000,,,,,,0.2350470
RGSPEYGR,ph,S,241,true,"Chloroplast kinase substrates",60,19376835,"MASCOT Score",38.4000000,,,,,,0.5542720
RGSPEYGR,ph,S,241,true,"SnRK2 protein kinase substrates",85,23776212,XCorr,2.7243760,1.0000000,,,,0.00090797600569203,
RGSPEYGR,ph,S,241,true,"atm and atr DNA damage response",88,25561503,"MASCOT Score",48.0000000,1.0000000,,,,,0.1800000
RGSPEYGR,ph,S,241,true,"TOR Kinase and ABA Receptor",100,29290610,XCorr,2.6523054,1.0000000,,,,0.0051799998618662,
RGSPEYGR,ph,S,241,true,"Col-0 callus - FC Col-0 vs. Col-0 Xray",111a,31410901,,37.6300000,,-0.5972454,0.0000000,NO,,-0.0387931
RGSPEYGR,ph,S,241,true,"Col-0 X-ray callus - FC Col-0 vs. Col-0 Xray",111b,31410901,,37.6300000,,-0.5972454,0.0000000,NO,,-0.0387931
RGSPEYGR,ph,S,241,true,"atm callus - FC atm vs. atm Xray",111c,31410901,,37.6300000,,-3.9704743,0.0000000,NO,,-0.0387931
RGSPEYGR,ph,S,241,true,"atm-3 X-ray callus - FC atm vs. atm Xray",111d,31410901,,37.6300000,,-3.9704743,0.0000000,NO,,-0.0387931
RGSPEYGR,ph,S,241,true,"Tissue atlas Arabidopsis - ProteomicsDB",114,32188942,"MaxQuant score",113.0300000,1.0000000,,,,0.0026270200032741,
VASPTKYSR,ph,S,262,true,"Chloroplast kinase substrates",60,19376835,"MASCOT Score",39.5700000,,,,,,0.2217650
VASPTKYSR,ph,S,262,true,"Tissue atlas Arabidopsis - ProteomicsDB",114,32188942,"MaxQuant score",74.5370000,0.9998840,,,,0.0051759001798928,
VASPTKYSR,ph,S,267,true,"Tissue atlas Arabidopsis - ProteomicsDB",114,32188942,"MaxQuant score",74.5370000,0.9948530,,,,0.0051759001798928,
MSPNHSPFKKESPR,ph,S,278,true,"srk2dei ABA signaling phopshoproteomics",83,23572148,"MASCOT Score",23.0000000,,,,,,0.0000000
MSPNHSPFKKESPR,ph,S,278,true,"SnRK2 protein kinase substrates",85,23776212,XCorr,3.1481266,1.0000000,,,,0.0019472599960864,
MSPNHSPFKKESPR,ph,S,278,true,"Phospho cell culture sucrose/TOR",109,30833711,,,1.0000000,,,,,
MSPNHSPFKKESPR,ph,S,278,true,"Tissue atlas Arabidopsis - ProteomicsDB",114,32188942,"MaxQuant score",181.8700000,1.0000000,,,,1.096060040824E-14,
ERMSPNHSPFK,ph,S,278,true,"Large-scale phosphorylation discovery",44,23111157,XCorr,2.8260000,,,,,,
ERMSPNHSPFK,ph,S,278,true,"atm and atr DNA damage response",88,25561503,"MASCOT Score",28.0000000,1.0000000,,,,,1.8700000
ERMSPNHSPFK,ph,S,278,true,"TOR Kinase and ABA Receptor",100,29290610,XCorr,3.6720195,1.0000000,,,,0.0032379999756813,
MSPNHSPFK,ph,S,278,true,"atm and atr DNA damage response",88,25561503,"MASCOT Score",51.0000000,1.0000000,,,,,-1.9100000
MSPNHSPFK,ph,S,278,true,"TOR Kinase and ABA Receptor",100,29290610,XCorr,2.4254179,0.9999000,,,,0.044959999620914,
MSPNHSPFKKESPR,ph,S,282,true,"srk2dei ABA signaling phopshoproteomics",83,23572148,"MASCOT Score",23.0000000,,,,,,0.0000000
MSPNHSPFKKESPR,ph,S,282,true,"SnRK2 protein kinase substrates",85,23776212,XCorr,3.1481266,1.0000000,,,,0.0019472599960864,
MSPNHSPFKKESPR,ph,S,282,true,"Tissue atlas Arabidopsis - ProteomicsDB",114,32188942,"MaxQuant score",137.3300000,1.0000000,,,,1.2846199979322E-6,
ERMSPNHSPFK,ph,S,282,true,"Large-scale phosphorylation discovery",44,23111157,XCorr,2.8260000,,,,,,
ERMSPNHSPFK,ph,S,282,true,"atm and atr DNA damage response",88,25561503,"MASCOT Score",28.0000000,1.0000000,,,,,1.8700000
ERMSPNHSPFK,ph,S,282,true,"TOR Kinase and ABA Receptor",100,29290610,XCorr,3.6720195,1.0000000,,,,0.0032379999756813,
MSPNHSPFK,ph,S,282,true,"atm and atr DNA damage response",88,25561503,"MASCOT Score",29.0000000,1.0000000,,,,,-2.2400000
KESPRNGVGEVESPIER,ph,S,288,true,"TOR Kinase and ABA Receptor",100,29290610,XCorr,4.4123001,1.0000000,,,,4.1029998101294E-6,
MSPNHSPFKKESPR,ph,S,288,true,"srk2dei ABA signaling phopshoproteomics",83,23572148,"MASCOT Score",23.0000000,,,,,,0.0000000
MSPNHSPFKKESPR,ph,S,288,true,"SnRK2 protein kinase substrates",85,23776212,XCorr,3.1481266,1.0000000,,,,0.0019472599960864,
MSPNHSPFKKESPR,ph,S,288,true,"Tissue atlas Arabidopsis - ProteomicsDB",114,32188942,"MaxQuant score",105.8400000,1.0000000,,,,0.00044035099563189,
KESPRNGVGEVESPIER,ph,S,298,true,"TOR Kinase and ABA Receptor",100,29290610,XCorr,4.4123001,1.0000000,,,,4.1029998101294E-6,
NGVGEVESPIERR,ph,S,298,true,"Arabidopsis root NAA phosphoproteome",18a,27643528,"MaxQuant Score",88.7680000,1.0000000,,,,1.0600000166505E-7,-0.3850000
NGVGEVESPIERR,ph,S,298,true,"STN8 phosphoproteome",38,21768351,"MASCOT Score",60.6800000,,,,,,-0.7036010
NGVGEVESPIERR,ph,S,298,true,"Phosphoproteome ethylene-regulated time response",46,24043427,"MASCOT Score",56.7200000,,,,,,-4.5218000
NGVGEVESPIERR,ph,S,298,true,"Chloroplast kinase substrates",60,19376835,"MASCOT Score",56.9100000,,,,,,-1.1107700
NGVGEVESPIERR,ph,S,298,true,"BSK8 and BSL2 regulating sucrose-ph synthase",66,24924143,"MaxQuant Score",135.4700000,,,,,,-0.2064700
NGVGEVESPIERR,ph,S,298,true,"srk2dei ABA signaling phopshoproteomics",83,23572148,"MASCOT Score",44.0000000,,,,,,-0.0013000
NGVGEVESPIERR,ph,S,298,true,"SnRK2 protein kinase substrates",85,23776212,XCorr,3.4773536,1.0000000,,,,0.0018011600477621,
NGVGEVESPIERR,ph,S,298,true,"TOR Kinase and ABA Receptor",100,29290610,XCorr,3.0245953,1.0000000,,,,0.00028760000714101,
NGVGEVESPIERR,ph,S,298,true,"Col-0 callus - FC Col-0 vs. Col-0 Xray",111a,31410901,,42.1600000,,0.0531880,0.0000000,NO,,1.0372513
NGVGEVESPIERR,ph,S,298,true,"Col-0 X-ray callus - FC Col-0 vs. Col-0 Xray",111b,31410901,,42.1600000,,0.0531880,0.0000000,NO,,1.0372513
NGVGEVESPIERR,ph,S,298,true,"atm callus - FC atm vs. atm Xray",111c,31410901,,42.1600000,,0.0224151,0.0000000,NO,,1.0372513
NGVGEVESPIERR,ph,S,298,true,"atm-3 X-ray callus - FC atm vs. atm Xray",111d,31410901,,42.1600000,,0.0224151,0.0000000,NO,,1.0372513
NGVGEVESPIERR,ph,S,298,true,"Tissue atlas Arabidopsis - ProteomicsDB",114,32188942,"MaxQuant score",234.5200000,1.0000000,,,,0,
NGVGEVESPIERR,ph,S,298,true,"Touch-induced phosphorylation: 40s touch vs untouc",136,30291188,"MASCOT score",57.3300000,,-0.7799352,0.5864635,NO,,9.0006330
NGVGEVESPIER,ph,S,298,true,"Phosphorylation nuclei-enriched fractions",28,19245862,,,,,,,,
NGVGEVESPIER,ph,S,298,true,"Immuno-dot blot phosphorylation",31,19341826,"MASCOT Score",43.0100000,,,,,,
NGVGEVESPIER,ph,S,298,true,"STN8 phosphoproteome",38,21768351,"MASCOT Score",74.1900000,,,,,,-0.9090970
NGVGEVESPIER,ph,S,298,true,"Phosphoproteomic analysis of seed maturation",42,22440515,"MASCOT Score",32.0000000,,,,,,0.7100000
NGVGEVESPIER,ph,S,298,true,"Pollen phosphoproteome Arabidopsis",43,22631563,"MASCOT Score",45.4700000,,,,,,
NGVGEVESPIER,ph,S,298,true,"Phosphoproteome ethylene-regulated time response",46,24043427,"MASCOT Score",42.2900000,,,,,,0.8968000
NGVGEVESPIER,ph,S,298,true,"Tyrosine phosphorylation in Arabidopsis",59,18463617,"MASCOT Score",60.0000000,,,,,,-0.5862539
NGVGEVESPIER,ph,S,298,true,"Chloroplast kinase substrates",60,19376835,"MASCOT Score",74.7700000,,,,,,-0.9090970
NGVGEVESPIER,ph,S,298,true,"srk2dei ABA signaling phopshoproteomics",83,23572148,"MASCOT Score",63.0000000,,,,,,-0.0007000
NGVGEVESPIER,ph,S,298,true,"LAXIC - ABA stress",84a,23660473,XCorr,2.9600000,1.0000000,,,,0.0099998898804188,
NGVGEVESPIER,ph,S,298,true,"LAXIC - mannitol vs control",84b,23660473,XCorr,2.7800000,1.0000000,,,,0.00020267900254112,
NGVGEVESPIER,ph,S,298,true,"SnRK2 protein kinase substrates",85,23776212,XCorr,2.9889801,1.0000000,,,,0.028839699923992,
NGVGEVESPIER,ph,S,298,true,"SIRK1 phosphorylation",86a,23820729,"MaxQuant Score",124.6100000,1.0000000,,,,0.013000000268221,-0.1130000
NGVGEVESPIER,ph,S,298,true,"atm and atr DNA damage response",88,25561503,"MASCOT Score",68.0000000,1.0000000,,,,,-0.7500000
NGVGEVESPIER,ph,S,298,true,"TOR Kinase and ABA Receptor",100,29290610,XCorr,3.6184058,1.0000000,,,,0.0024129999801517,
NGVGEVESPIER,ph,S,298,true,"Lateral root-induction - NAA vs control",106,23328941,"MASCOT Score",29.0000000,,,,,,
NGVGEVESPIER,ph,S,298,true,"Col-0 callus - FC Col-0 vs. Col-0 Xray",111a,31410901,,49.7800000,,-0.0255178,0.0000000,NO,,0.5563710
NGVGEVESPIER,ph,S,298,true,"Col-0 X-ray callus - FC Col-0 vs. Col-0 Xray",111b,31410901,,49.7800000,,-0.0255178,0.0000000,NO,,0.5563710
NGVGEVESPIER,ph,S,298,true,"atm callus - FC atm vs. atm Xray",111c,31410901,,49.7800000,,-0.1337139,0.0000000,NO,,0.5563710
NGVGEVESPIER,ph,S,298,true,"atm-3 X-ray callus - FC atm vs. atm Xray",111d,31410901,,49.7800000,,-0.1337139,0.0000000,NO,,0.5563710
ERSRSSPENGQVESPGSIGR,ph,S,306,true,"atm and atr DNA damage response",88,25561503,"MASCOT Score",32.0000000,1.0000000,,,,,0.0600000
SRSSPENGQVESPGSIGRR,ph,S,306,true,"SnRK2 protein kinase substrates",85,23776212,XCorr,2.5155368,0.8950000,,,,0.14578600227833,
SRSSPENGQVESPGSIGR,ph,S,306,true,"atm and atr DNA damage response",88,25561503,"MASCOT Score",30.0000000,0.9240000,,,,,1.9400000
ERSRSSPENGQVESPGSIGR,ph,S,308,true,"atm and atr DNA damage response",88,25561503,"MASCOT Score",32.0000000,0.9830000,,,,,0.0600000
SRSSPENGQVESPGSIGR,ph,S,308,true,"Conserved plant phosphoproteome - Arabidopsis",61a,20466843,"MASCOT Score",32.0000000,1.0000000,,,,,
SRSSPENGQVESPGSIGR,ph,S,308,true,"atm and atr DNA damage response",88,25561503,"MASCOT Score",61.0000000,0.9920000,,,,,-0.2300000
SRSSPENGQVESPGSIGR,ph,S,308,true,"TOR Kinase and ABA Receptor",100,29290610,XCorr,4.2222452,0.8203000,,,,1.2120000064897E-5,
SRSSPENGQVESPGSIGR,ph,S,308,true,"Tissue atlas Arabidopsis - ProteomicsDB",114,32188942,"MaxQuant score",239.5700000,0.9236240,,,,0,
SRSSPENGQVESPGSIGRR,ph,S,309,true,"srk2dei ABA signaling phopshoproteomics",83,23572148,"MASCOT Score",34.0000000,,,,,,0.0038000
SRSSPENGQVESPGSIGRR,ph,S,309,true,"TOR Kinase and ABA Receptor",100,29290610,XCorr,3.7429879,0.8558000,,,,0.0015960000455379,
SRSSPENGQVESPGSIGR,ph,S,309,true,"LAXIC - mannitol vs control",84b,23660473,XCorr,4.5000000,0.8590000,,,,1.7399999308054E-7,
SRSSPENGQVESPGSIGR,ph,S,309,true,"SnRK2 protein kinase substrates",85,23776212,XCorr,4.1404767,0.9950000,,,,3.7072501813458E-15,
SRSSPENGQVESPGSIGR,ph,S,309,true,"atm and atr DNA damage response",88,25561503,"MASCOT Score",61.0000000,0.9900000,,,,,-0.2000000
SRSSPENGQVESPGSIGR,ph,S,309,true,"TOR Kinase and ABA Receptor",100,29290610,XCorr,6.0187573,0.9031000,,,,1.3679999710803E-6,
SRSSPENGQVESPGSIGR,ph,S,309,true,"Tissue atlas Arabidopsis - ProteomicsDB",114,32188942,"MaxQuant score",295.1600000,0.9787390,,,,0,
SSPENGQVESPGSIGRR,ph,S,309,true,"atm and atr DNA damage response",88,25561503,"MASCOT Score",27.0000000,0.9870000,,,,,2.0100000
SSPENGQVESPGSIGR,ph,S,309,true,"atm and atr DNA damage response",88,25561503,"MASCOT Score",66.0000000,0.9970000,,,,,-0.1400000
ERSRSSPENGQVESPGSIGR,ph,S,317,true,"atm and atr DNA damage response",88,25561503,"MASCOT Score",32.0000000,1.0000000,,,,,0.0600000
SRSSPENGQVESPGSIGRR,ph,S,317,true,"srk2dei ABA signaling phopshoproteomics",83,23572148,"MASCOT Score",34.0000000,,,,,,0.0038000
SRSSPENGQVESPGSIGRR,ph,S,317,true,"SnRK2 protein kinase substrates",85,23776212,XCorr,2.5155368,1.0000000,,,,0.14578600227833,
SRSSPENGQVESPGSIGRR,ph,S,317,true,"TOR Kinase and ABA Receptor",100,29290610,XCorr,3.7429879,1.0000000,,,,0.0015960000455379,
SRSSPENGQVESPGSIGR,ph,S,317,true,"LAXIC - mannitol vs control",84b,23660473,XCorr,4.5000000,1.0000000,,,,1.7399999308054E-7,
SRSSPENGQVESPGSIGR,ph,S,317,true,"SnRK2 protein kinase substrates",85,23776212,XCorr,4.1404767,1.0000000,,,,3.7072501813458E-15,
SRSSPENGQVESPGSIGR,ph,S,317,true,"atm and atr DNA damage response",88,25561503,"MASCOT Score",61.0000000,1.0000000,,,,,-0.2000000
SRSSPENGQVESPGSIGR,ph,S,317,true,"TOR Kinase and ABA Receptor",100,29290610,XCorr,6.0187573,0.9999000,,,,1.3679999710803E-6,
SSPENGQVESPGSIGRR,ph,S,317,true,"atm and atr DNA damage response",88,25561503,"MASCOT Score",27.0000000,1.0000000,,,,,2.0100000
SSPENGQVESPGSIGR,ph,S,317,true,"LAXIC - mannitol vs control",84b,23660473,XCorr,3.6400000,0.9940000,,,,0.00018937500135507,
SSPENGQVESPGSIGR,ph,S,317,true,"SnRK2 protein kinase substrates",85,23776212,XCorr,2.5250025,0.9810000,,,,0.0081407399848104,
SSPENGQVESPGSIGR,ph,S,317,true,"atm and atr DNA damage response",88,25561503,"MASCOT Score",66.0000000,1.0000000,,,,,-0.1400000
SSPENGQVESPGSIGR,ph,S,317,true,"Tissue atlas Arabidopsis - ProteomicsDB",114,32188942,"MaxQuant score",295.1600000,1.0000000,,,,0,
ERSRSSPENGQVESPGSIGR,ph,S,320,true,"atm and atr DNA damage response",88,25561503,"MASCOT Score",32.0000000,1.0000000,,,,,0.0600000
SRSSPENGQVESPGSIGRR,ph,S,320,true,"srk2dei ABA signaling phopshoproteomics",83,23572148,"MASCOT Score",34.0000000,,,,,,0.0038000
SRSSPENGQVESPGSIGRR,ph,S,320,true,"SnRK2 protein kinase substrates",85,23776212,XCorr,2.5155368,1.0000000,,,,0.14578600227833,
SRSSPENGQVESPGSIGRR,ph,S,320,true,"TOR Kinase and ABA Receptor",100,29290610,XCorr,3.7429879,1.0000000,,,,0.0015960000455379,
SRSSPENGQVESPGSIGR,ph,S,320,true,"atm and atr DNA damage response",88,25561503,"MASCOT Score",61.0000000,1.0000000,,,,,-0.2000000
SSPENGQVESPGSIGRR,ph,S,320,true,"atm and atr DNA damage response",88,25561503,"MASCOT Score",27.0000000,1.0000000,,,,,2.0100000
SSPENGQVESPGSIGR,ph,S,320,true,"Tissue atlas Arabidopsis - ProteomicsDB",114,32188942,"MaxQuant score",262.3300000,1.0000000,,,,0,
RDSDGGYDGAESPMQK,ph,S,326,true,"LAXIC - mannitol vs control",84b,23660473,XCorr,5.4300000,1.0000000,,,,4.3000000791257E-16,
RDSDGGYDGAESPMQK,ph,S,326,true,"SnRK2 protein kinase substrates",85,23776212,XCorr,4.8204074,1.0000000,,,,0.00028518500039354,
RDSDGGYDGAESPMQK,ph,S,326,true,"atm and atr DNA damage response",88,25561503,"MASCOT Score",44.0000000,0.9970000,,,,,0.1900000
RDSDGGYDGAESPMQK,ph,S,326,true,"TOR Kinase and ABA Receptor",100,29290610,XCorr,6.2557068,1.0000000,,,,3.7609999559152E-9,
RDSDGGYDGAESPMQK,ph,S,326,true,"Tissue atlas Arabidopsis - ProteomicsDB",114,32188942,"MaxQuant score",268.3100000,1.0000000,,,,0,
DSDGGYDGAESPMQK,ph,S,326,true,"atm and atr DNA damage response",88,25561503,"MASCOT Score",61.0000000,0.9970000,,,,,0.3200000
DSDGGYDGAESPMQK,ph,S,326,true,"Lateral root-induction - NAA vs control",106,23328941,"MASCOT Score",44.0000000,,,,,,
RDSDGGYDGAESPMQK,ph,S,335,true,"LAXIC - mannitol vs control",84b,23660473,XCorr,5.4300000,1.0000000,,,,4.3000000791257E-16,
RDSDGGYDGAESPMQK,ph,S,335,true,"SnRK2 protein kinase substrates",85,23776212,XCorr,4.3445826,1.0000000,,,,6.0721501611571E-12,
RDSDGGYDGAESPMQK,ph,S,335,true,"atm and atr DNA damage response",88,25561503,"MASCOT Score",44.0000000,1.0000000,,,,,0.1900000
RDSDGGYDGAESPMQK,ph,S,335,true,"TOR Kinase and ABA Receptor",100,29290610,XCorr,6.2557068,1.0000000,,,,3.7609999559152E-9,
RDSDGGYDGAESPMQK,ph,S,335,true,"Tissue atlas Arabidopsis - ProteomicsDB",114,32188942,"MaxQuant score",441.9500000,1.0000000,,,,0,
DSDGGYDGAESPMQK,ph,S,335,true,"STN8 phosphoproteome",38,21768351,"MASCOT Score",52.3800000,,,,,,
DSDGGYDGAESPMQK,ph,S,335,true,"Tyrosine phosphorylation in Arabidopsis",59,18463617,"MASCOT Score",46.0000000,,,,,,-0.6114058
DSDGGYDGAESPMQK,ph,S,335,true,"srk2dei ABA signaling phopshoproteomics",83,23572148,"MASCOT Score",69.0000000,,,,,,-0.0010000
DSDGGYDGAESPMQK,ph,S,335,true,"SnRK2 protein kinase substrates",85,23776212,XCorr,4.4425163,1.0000000,,,,3.9643100535613E-6,
DSDGGYDGAESPMQK,ph,S,335,true,"atm and atr DNA damage response",88,25561503,"MASCOT Score",88.0000000,1.0000000,,,,,0.2100000
DSDGGYDGAESPMQK,ph,S,335,true,"TOR Kinase and ABA Receptor",100,29290610,XCorr,5.5761695,1.0000000,,,,1.1630000074092E-7,
DSDGGYDGAESPMQK,ph,S,335,true,"Lateral root-induction - NAA vs control",106,23328941,"MASCOT Score",45.0000000,,,,,,
DSDGGYDGAESPMQK,ph,S,335,true,"Phospho cell culture sucrose/TOR",109,30833711,,,1.0000000,,,,,
SRSPRSPPADE,ph,S,340,true,"LAXIC - mannitol vs control",84b,23660473,XCorr,2.0800000,1.0000000,,,,0.081061601638794,
SRSPRSPPADE,ph,S,340,true,"Tissue atlas Arabidopsis - ProteomicsDB",114,32188942,"MaxQuant score",121.3900000,1.0000000,,,,3.2238898711512E-5,
SRSPRSPPADE,ph,S,342,true,"Phosphorylation RNA metabolism",22,16807317,,,,,,,,
SRSPRSPPADE,ph,S,342,true,"LAXIC - mannitol vs control",84b,23660473,XCorr,2.0800000,1.0000000,,,,0.081061601638794,
SRSPRSPPADE,ph,S,342,true,"SnRK2 protein kinase substrates",85,23776212,XCorr,2.7246640,0.9980000,,,,0.014577499590814,
SRSPRSPPADE,ph,S,342,true,"Tissue atlas Arabidopsis - ProteomicsDB",114,32188942,"MaxQuant score",163.6200000,1.0000000,,,,4.6639297979212E-10,
SRSPRSPPADE,ph,S,345,true,"Phosphorylation RNA metabolism",22,16807317,,,,,,,,
SRSPRSPPADE,ph,S,345,true,"LAXIC - mannitol vs control",84b,23660473,XCorr,2.0800000,1.0000000,,,,0.081061601638794,
SRSPRSPPADE,ph,S,345,true,"SnRK2 protein kinase substrates",85,23776212,XCorr,2.7246640,1.0000000,,,,0.014577499590814,
SRSPRSPPADE,ph,S,345,true,"Tissue atlas Arabidopsis - ProteomicsDB",114,32188942,"MaxQuant score",163.6200000,1.0000000,,,,4.6639297979212E-10,
