Peptide,PTM,ModifiedAA,ModifiedPosition,PeptideUniqueToGene,ExperimentDesc,ExpID,PubmedID,ScoreType,IdentScore,LocProb,Log2FChange,PQ-val,QuantSig,PEP,MassErrorPPM
ASTVLNVPIAQPE,nt,A,64,true,"Arg/N-end rule seed, prt6 vs. Wt",99,29168982,"MASCOT Score",42.0000000,,0.5128634,0.6859489,NO,0.0084100002422929,-0.7156808
STVLNVPIAQPENGSSDKIPKWSAR,nt,S,65,true,"Arg/N-end rule pathway Roots",80,25728785,"MASCOT Score",30.6600000,,,,,1.3769999895885E-5,
STVLNVPIAQPENGSSDKIPKWSAR,nt,S,65,true,"Stromal N-terminome",96,26371235,"MASCOT Score",36.8700000,,,,,,
STVLNVPIAQPENGSSDKIPKWSAR,nt,S,65,true,"HUNTER N-terminome: legumain, GluC and trypsin",119,31951383,"MaxQuant score",71.6560000,,,,,,
STVLNVPIAQPENGSS,nt,S,65,true,"Arabidopsis translation initiation landscape - NT",167b,35069635,,,,,,,,
STVLNVPIAQPEN,nt,S,65,true,"HUNTER N-terminome: legumain, GluC and trypsin",119,31951383,"MaxQuant score",92.8660000,,,,,,
STVLNVPIAQPE,nt,S,65,true,"Arg/N-end rule seed, prt6 vs. Wt",99,29168982,"MASCOT Score",42.2500000,,0.0280110,0.8681166,NO,0.00022940000053495,-3.0259934
STVLNVPIAQPE,nt,S,65,true,"HUNTER N-terminome: legumain, GluC and trypsin",119,31951383,"MaxQuant score",164.6400000,,,,,,
STVLNVPIAQPENGSSDKIPKWSAR,nta,S,65,true,"FtsH12 N-terminome: WT / FtsH12 knockdown miRNA",118,33216923,"MaxQuant score",270.2000000,,,,,0,
STVLNVPIAQPE,nta,S,65,true,"HUNTER N-terminome: legumain, GluC and trypsin",119,31951383,"MaxQuant score",141.0800000,,,,,,
TVLNVPIAQPE,nt,T,66,true,"Arg/N-end rule seed, prt6 vs. Wt",99,29168982,"MASCOT Score",94.2900000,,0.3880692,0.1044765,NO,3.3389999316569E-6,-1.0143966
SLAMGELEARK,mox,M,96,true,"cat2 Methionine oxidation - 1h stress",62a,25693801,"MASCOT Score",60.0000000,,0.2552497,,NO,,
SLAMGELEARK,mox,M,96,true,"cat2 Methionine oxidation - 3h stress",62b,25693801,"MASCOT Score",57.0000000,,0.1087279,,NO,,
LGFNEDKAK,ac,K,217,true,"Quantitative Acetylproteomics",101,29440448,,,,,,,,
