Peptide,PTM,ModifiedAA,ModifiedPosition,PeptideUniqueToGene,ExperimentDesc,ExpID,PubmedID,ScoreType,IdentScore,LocProb,Log2FChange,PQ-val,QuantSig,PEP,MassErrorPPM
MNNLFNR,nta,M,54,true,"Characterization plant N-terminal acetylation",6,22223895,"MASCOT Score",47.8700000,,,,,,
RLGFGSRPQAQADPSSAAIAQGPDD,nta,R,60,true,"HUNTER N-terminome: legumain, GluC and trypsin",119,31951383,"MaxQuant score",59.3240000,,,,,,
AQADPSSAAIAQGPDD,nt,A,69,true,"HUNTER N-terminome: legumain, GluC and trypsin",119,31951383,"MaxQuant score",111.1200000,,,,,,
TEVGYSHGIVHNPSYEDVCTGTTGHNEVVR,ph,S,130,true,"Tissue atlas Arabidopsis - ProteomicsDB",114,32188942,"MaxQuant score",241.9600000,1.0000000,,,,0,
TEVGYSHGIVHNPSYEDVCTGTTGHNEVVR,ph,Y,131,true,"TOR Kinase and ABA Receptor",100,29290610,XCorr,5.4380984,0.8567000,,,,6.366000206981E-7,
TEVGYSHGIVHNPSYEDVCTGTTGHNEVVR,so,C,135,true,"Arabidopsis S-sulfenylation chemoproteomics",108,31578252,"pFind PSM Score",0.0119147,,0.8064500,,,,-1.6046287
ECSFESLLDVFWNR,ox,C,154,true,"Redox kickstart of mitochondria",112,31871212,,,,-1.7158326,0.0113592,YES,,
SGIYYYTDEQER,nt,S,185,true,"N-terminal ChaFRADIC",92,26010716,"MASCOT Score",50.8500000,,,,,3.3519998396514E-5,
SGIYYYTDEQER,nt,S,185,true,"Arabidopsis translation initiation landscape - NT",167b,35069635,,,,,,,,
AENYHQQYLAKGGR,nt,A,226,true,"Arabidopsis translation initiation landscape - NT",167b,35069635,,,,,,,,
GCKDPIR,sno,C,250,true,"hot5-4 / wildtype, FAT-switch S-nitrosoproteome",169,37277371,,,,,,,,
