Peptide,PTM,ModifiedAA,ModifiedPosition,PeptideUniqueToGene,ExperimentDesc,ExpID,PubmedID,ScoreType,IdentScore,LocProb,Log2FChange,PQ-val,QuantSig,PEP,MassErrorPPM
AASSAVTANYVLKPPPFALD,nt,A,2,true,"N-terminal ChaFRADIC",92,26010716,"MASCOT Score",20.9400000,,,,,0.0001782000035746,
AASSAVTANYVLKPPPFALD,nt,A,2,true,"Arg/N-end rule seed, prt6 vs. Wt",99,29168982,"MASCOT Score",45.0500000,,,,,2.2339999641852E-11,-2.6393490
AASSAVTANY,nt,A,2,true,"Arg/N-end rule seed, prt6 vs. Wt",99,29168982,"MASCOT Score",34.5800000,,,,,0.1414999961853,0.6206810
AASSAVTANYVLKPPPFALDALEPH,nta,A,2,true,"Characterization plant N-terminal acetylation",6,22223895,"MASCOT Score",93.9400000,,,,,,
AASSAVTANYVLKPPPFALD,nta,A,2,true,"N-terminal ChaFRADIC",92,26010716,"MASCOT Score",20.9400000,,,,,0.0001782000035746,
AASSAVTANYVLKPPPFALD,nta,A,2,true,"Arg/N-end rule seed, prt6 vs. Wt",99,29168982,"MASCOT Score",45.0500000,,-0.2997596,0.6054209,NO,2.2339999641852E-11,-2.6393490
AASSAVTANYVLKPPPFALD,nta,A,2,true,"HUNTER N-terminome: legumain, GluC and trypsin",119,31951383,"MaxQuant score",61.2120000,,,,,,
AASSAVTANYVLKPPPFALD,nta,A,2,true,"Arabidopsis translation initiation landscape - NTA",167a,35069635,,,,,,,,
AASSAVTANY,nta,A,2,true,"Arg/N-end rule pathway Roots",80,25728785,"MASCOT Score",68.7800000,,,,,2.8110000130255E-5,
AASSAVTANY,nta,A,2,true,"Arg/N-end rule seed, prt6 vs. Wt",99,29168982,"MASCOT Score",34.5800000,,,,,0.1414999961853,0.6206810
ASSAVTANYVLKPPPFALD,nta,A,3,true,"HUNTER N-terminome: legumain, GluC and trypsin",119,31951383,"MaxQuant score",,,,,,,
NYVLKPPPFALD,nt,N,10,true,"HUNTER N-terminome: legumain, GluC and trypsin",119,31951383,"MaxQuant score",96.3420000,,,,,,
NYVLKPPPFALD,nt,N,10,true,"Arabidopsis translation initiation landscape - NT",167b,35069635,,,,,,,,
QTLEFHWGKHHR,ac,K,38,true,"Histone deacetylases substrates - hda14 vs WT",98e,29061669,"MaxQuant Score",58.2000000,1.0000000,-0.1090000,0.9120108,NO,0.00046999999904074,
QTLEFHWGKHHR,ub,K,38,true,"upl3 mutant / wildtype",168,35926874,"MaxQuant score",84.4790000,1.0000000,-1.6170561,,,0.00010330000077374,0.1238100
AYVDNLKK,ac,K,48,true,"Quantitative Acetylproteomics",101,29440448,,,,,,,,
TYNNGDLLPAFNNAAQAWNHE,nt,T,68,true,"N-terminal ChaFRADIC",92,26010716,"MASCOT Score",58.7300000,,,,,8.2140001467224E-9,
TYNNGDLLPA,nt,T,68,true,"N-terminal ChaFRADIC",92,26010716,"MASCOT Score",74.8400000,,,,,9.3409998953575E-6,
LEAAKAASA,co2,K,208,true,"Carbon dioxide modifications Arabidopsis",121,30082797,,,,,,,,
LEAAKAASA,ub,K,208,true,"Arabidopsis ubiquitination COFRADIC",40,26744219,"MaxQuant Score",90.1500000,1.0000000,,,,0.0060000000521541,0.1390000
