Peptide,PTM,ModifiedAA,ModifiedPosition,PeptideUniqueToGene,ExperimentDesc,ExpID,PubmedID,ScoreType,IdentScore,LocProb,Log2FChange,PQ-val,QuantSig,PEP,MassErrorPPM
SDLVATSPSPSSAPR,nt,S,2,true,"Arg/N-end rule seed, prt6 vs. Wt",99,29168982,"MASCOT Score",87.6200000,,,,,0.00044279999565333,-1.2301773
SDLVATSPSP,nt,S,2,true,"N-term acetylation drought responses",5,26184543,,,,,,,,
SDLVATSPSPSSAPRSAT,nta,S,2,true,"Arabidopsis translation initiation landscape - NTA",167a,35069635,,,,,,,,
SDLVATSPSPSSAPR,nta,S,2,true,"Characterization plant N-terminal acetylation",6,22223895,"MASCOT Score",66.8800000,,,,,,
SDLVATSPSPSSAPR,nta,S,2,true,"Arg/N-end rule pathway Roots",80,25728785,"MASCOT Score",55.1900000,,,,,0.0011119999689981,
SDLVATSPSPSSAPR,nta,S,2,true,"Arg/N-end rule seed, prt6 vs. Wt",99,29168982,"MASCOT Score",87.6200000,,,,,0.00044279999565333,-1.2301773
SDLVATSPSPSSAPR,nta,S,2,true,"HUNTER N-terminome: legumain, GluC and trypsin",119,31951383,"MaxQuant score",118.2800000,,,,,,
SDLVATSPSP,nta,S,2,true,"N-term acetylation drought responses",5,26184543,,,,,,,,
SDLVATSPSPSSAPR,ph,T,7,true,"Lateral root-induction - NAA vs control",106,23328941,"MASCOT Score",24.0000000,,,,,,
SDLVATSPSPSSAPR,ph,S,8,true,"Lateral root-induction - NAA vs control",106,23328941,"MASCOT Score",24.0000000,,,,,,
SDLVATSPSPSSAPR,ph,S,8,true,"Tissue atlas Arabidopsis - ProteomicsDB",114,32188942,"MaxQuant score",175.0100000,0.9844730,,,,8.2783698036909E-19,
SDLVATSPSPSSAPR,ph,S,10,true,"atm and atr DNA damage response",88,25561503,"MASCOT Score",42.0000000,1.0000000,,,,,-0.1100000
SDLVATSPSPSSAPR,ph,S,10,true,"Phospho cell culture sucrose/TOR",109,30833711,,,0.9047270,,,,,
SDLVATSPSPSSAPR,ph,S,12,true,"atm and atr DNA damage response",88,25561503,"MASCOT Score",24.0000000,0.8630000,,,,,0.3200000
SDLVATSPSPSSAPR,ph,S,13,true,"atm and atr DNA damage response",88,25561503,"MASCOT Score",24.0000000,0.8630000,,,,,0.3200000
VLPSTPSDWQNEDANSMGR,ph,S,180,true,"Tissue atlas Arabidopsis - ProteomicsDB",114,32188942,"MaxQuant score",158.5000000,1.0000000,,,,9.1977101658776E-26,
AEAICVEFMK,so,C,409,true,"Arabidopsis S-sulfenylation chemoproteomics",108,31578252,"pFind PSM Score",0.0237940,,0.7462700,,,,-1.0225652
RGGAASGVSDQNVSETDK,me1,R,692,true,"Arabidopsis protein methylome",123,31809900,"MaxQuant Score",153.1800000,1.0000000,,,,0,0.3625500
GGAASGVSDQNVSETDK,ph,S,697,true,"Tissue atlas Arabidopsis - ProteomicsDB",114,32188942,"MaxQuant score",249.8900000,1.0000000,,,,0,
