Peptide,PTM,ModifiedAA,ModifiedPosition,PeptideUniqueToGene,ExperimentDesc,ExpID,PubmedID,ScoreType,IdentScore,LocProb,Log2FChange,PQ-val,QuantSig,PEP,MassErrorPPM
AVLSGDGTALTTDSKEAGLRGKL,nt,A,74,true,"Arabidopsis translation initiation landscape - NT",167b,35069635,,,,,,,,
AVLSGDGTALTTDSKEAGLR,nt,A,74,true,"N-terminal ChaFRADIC",92,26010716,"MASCOT Score",27.9500000,,,,,0.0001782000035746,
AVLSGDGTALTTDSKEAGLR,nt,A,74,true,"Stromal N-terminome",96,26371235,"MASCOT Score",50.6400000,,,,,,
AVLSGDGTALTTDSKE,nt,A,74,true,"N-terminal ChaFRADIC",92,26010716,"MASCOT Score",63.3800000,,,,,0.00056590000167489,
AVLSGDGTALTTDSKE,nt,A,74,true,"Stromal N-terminome",96,26371235,"MASCOT Score",63.5800000,,,,,,
AVLSGDGTALTTDSKE,nt,A,74,true,"Arg/N-end rule seed, prt6 vs. Wt",99,29168982,"MASCOT Score",75.3400000,,-0.0636297,0.2501980,NO,5.2659999028037E-8,-1.6157170
AVLSGDGTALTTDSKE,nt,A,74,true,"HUNTER N-terminome: legumain, GluC and trypsin",119,31951383,"MaxQuant score",99.0110000,,,,,,
AVLSGDGTALTTDSKEAGLR,nta,A,74,true,"N-terminal ChaFRADIC",92,26010716,"MASCOT Score",27.9500000,,,,,0.0001782000035746,
AVLSGDGTALTTDSKEAGLR,nta,A,74,true,"FtsH12 N-terminome: WT / FtsH12 knockdown miRNA",118,33216923,"MaxQuant score",109.2400000,,,,,2.5699999447364E-14,
AVLSGDGTALTTDSKE,nta,A,74,true,"N-terminal ChaFRADIC",92,26010716,"MASCOT Score",63.3800000,,,,,0.00056590000167489,
AVLSGDGTALTTDSK,nta,A,74,true,"Characterization plant N-terminal acetylation",6,22223895,"MASCOT Score",74.3200000,,,,,,
VLSGDGTALTTDSKEAGLRGKL,nt,V,75,true,"Arabidopsis translation initiation landscape - NT",167b,35069635,,,,,,,,
VLSGDGTALTTDSKEAGLR,nt,V,75,true,"Arg/N-end rule pathway Roots",80,25728785,"MASCOT Score",109.9800000,,,,,4.0919999051529E-13,
VLSGDGTALTTDSKEAGLR,nt,V,75,true,"N-terminal ChaFRADIC",92,26010716,"MASCOT Score",57.1400000,,,,,2.0609999751287E-7,
VLSGDGTALTTDSKEAGLR,nt,V,75,true,"Stromal N-terminome",96,26371235,"MASCOT Score",91.6400000,,,,,,
VLSGDGTALTTDSKEAGLR,nt,V,75,true,"Arg/N-end rule seed, prt6 vs. Wt",99,29168982,"MASCOT Score",71.0400000,,,,,2.1629999537254E-5,-1.9221566
VLSGDGTALTTDSKEAGLR,nt,V,75,true,"FtsH12 N-terminome: WT / FtsH12 knockdown miRNA",118,33216923,"MaxQuant score",79.6950000,,,,,1.1599999606704E-11,
VLSGDGTALTTDSKEAGLR,nt,V,75,true,"HUNTER N-terminome: legumain, GluC and trypsin",119,31951383,"MaxQuant score",58.1580000,,,,,,
VLSGDGTALTTDSKE,nt,V,75,true,"N-terminal ChaFRADIC",92,26010716,"MASCOT Score",67.0500000,,,,,6.4070000007632E-6,
VLSGDGTALTTDSKE,nt,V,75,true,"Arg/N-end rule seed, prt6 vs. Wt",99,29168982,"MASCOT Score",91.6300000,,0.3271861,0.1151816,NO,7.9050002654846E-11,0.7684326
VLSGDGTALTTDSKE,nt,V,75,true,"HUNTER N-terminome: legumain, GluC and trypsin",119,31951383,"MaxQuant score",180.2800000,,,,,,
VLSGDGTALTTDSK,nt,V,75,true,"Stromal N-terminome",96,26371235,"MASCOT Score",77.5900000,,,,,,
VLSGDGTALTTD,nt,V,75,true,"HUNTER N-terminome: legumain, GluC and trypsin",119,31951383,"MaxQuant score",92.4390000,,,,,,
VLSGDGTALTTDSKEAGLRGKL,nta,V,75,true,"Arabidopsis translation initiation landscape - NTA",167a,35069635,,,,,,,,
VLSGDGTALTTDSKEAGLR,nta,V,75,true,"Arg/N-end rule pathway Roots",80,25728785,"MASCOT Score",100.3700000,,,,,1.6260000013091E-9,
VLSGDGTALTTDSKEAGLR,nta,V,75,true,"N-terminal ChaFRADIC",92,26010716,"MASCOT Score",57.1400000,,,,,2.0609999751287E-7,
VLSGDGTALTTDSKEAGLR,nta,V,75,true,"Stromal N-terminome",96,26371235,"MASCOT Score",91.6400000,,,,,,
VLSGDGTALTTDSKEAGLR,nta,V,75,true,"Arg/N-end rule seed, prt6 vs. Wt",99,29168982,"MASCOT Score",71.0400000,,0.0694323,0.6086474,NO,2.1629999537254E-5,-1.9221566
VLSGDGTALTTDSKEAGLR,nta,V,75,true,"FtsH12 N-terminome: WT / FtsH12 knockdown miRNA",118,33216923,"MaxQuant score",82.0070000,,,,,0.0069837998598814,
VLSGDGTALTTDSKEAGLR,nta,V,75,true,"HUNTER N-terminome: legumain, GluC and trypsin",119,31951383,"MaxQuant score",181.6700000,,,,,,
VLSGDGTALTTDSKE,nta,V,75,true,"N-terminal ChaFRADIC",92,26010716,"MASCOT Score",67.0500000,,,,,6.4070000007632E-6,
VLSGDGTALTTDSKE,nta,V,75,true,"Arg/N-end rule seed, prt6 vs. Wt",99,29168982,"MASCOT Score",91.6300000,,-0.0617345,0.5858243,NO,7.9050002654846E-11,0.7684326
VLSGDGTALTTDSKE,nta,V,75,true,"HUNTER N-terminome: legumain, GluC and trypsin",119,31951383,"MaxQuant score",117.2300000,,,,,,
VLSGDGTALTTDSK,nta,V,75,true,"Characterization plant N-terminal acetylation",6,22223895,"MASCOT Score",98.5100000,,,,,,
VLSGDGTALTTDSK,nta,V,75,true,"Stromal N-terminome",96,26371235,"MASCOT Score",77.5900000,,,,,,
VLSGDGTALTTD,nta,V,75,true,"HUNTER N-terminome: legumain, GluC and trypsin",119,31951383,"MaxQuant score",187.2200000,,,,,,
ELEGLEQKAK,ac,K,144,true,"Quantitative Acetylproteomics",101,29440448,,,,,,,,
DFIFPCLR,so,C,170,true,"S-sulfenylation site detection using YAP1C",110,32714340,,,,,,,,
AGAIYER,nt,A,173,true,"Arabidopsis translation initiation landscape - NT",167b,35069635,,,,,,,,
YLLGTSMARPVIAK,mox,M,187,true,"cat2 Methionine oxidation - 1h stress",62a,25693801,"MASCOT Score",69.0000000,,-0.0453628,,NO,,
YLLGTSMARPVIAK,mox,M,187,true,"cat2 Methionine oxidation - 3h stress",62b,25693801,"MASCOT Score",73.0000000,,1.4814898,,NO,,
AMVDVAAEVGADAVAHGCTGK,sno,C,212,true,"Site-specific nitrosomeproteomic id - gsnor1-3",90b,25699590,XCorr,3.9700000,,,,,0.00095289997989312,-7.0100000
AMVDVAAEVGADAVAHGCTGK,sno,C,212,true,"hot5-4 / wildtype, FAT-switch S-nitrosoproteome",169,37277371,,,,0.9994360,0.0000209,YES,,
AMVDVAAEVGADAVAHGCTGK,so,C,212,true,"Arabidopsis S-sulfenylation chemoproteomics",108,31578252,"pFind PSM Score",0.0000068,,1.3115000,,,,-1.0526956
AMVDVAAEVGADAVAHGCTGK,so,C,212,true,"S-sulfenylation site detection using YAP1C",110,32714340,,,,,,,,
SHEGDLL,nt,S,279,true,"N-terminal ChaFRADIC",92,26010716,"MASCOT Score",44.6400000,,,,,0.031649999320507,
QSPNSLYR,ph,S,450,true,"Tissue atlas Arabidopsis - ProteomicsDB",114,32188942,"MaxQuant score",79.4270000,0.9999990,,,,0.009536880068481,
QDISSFEGSEIYNQADAAGFIR,nt,Q,457,true,"HUNTER N-terminome: legumain, GluC and trypsin",119,31951383,"MaxQuant score",93.5830000,,,,,,
