Peptide,PTM,ModifiedAA,ModifiedPosition,PeptideUniqueToGene,ExperimentDesc,ExpID,PubmedID,ScoreType,IdentScore,LocProb,Log2FChange,PQ-val,QuantSig,PEP,MassErrorPPM
MEGFLTDQQR,nta,M,1,true,"N-term acetylation drought responses",5,26184543,,,,,,,,
MEGFLTDQQR,nta,M,1,true,"Characterization plant N-terminal acetylation",6,22223895,"MASCOT Score",65.8100000,,,,,,
MEGFLTDQQR,nta,M,1,true,"Arg/N-end rule pathway Roots",80,25728785,"MASCOT Score",61.6100000,,,,,0.00014509999891743,
MEGFLTDQQR,nta,M,1,true,"Stromal N-terminome",96,26371235,"MASCOT Score",46.1700000,,,,,,
MEGFLTDQQR,nta,M,1,true,"Arg/N-end rule seed, prt6 vs. Wt",99,29168982,"MASCOT Score",71.5100000,,,,,0.0068660001270473,-1.3336473
MEGFLTDQQR,nta,M,1,true,"FtsH12 N-terminome: WT / FtsH12 knockdown miRNA",118,33216923,"MaxQuant score",163.4500000,,,,,0,
MEGFLTDQQR,nta,M,1,true,"HUNTER N-terminome: legumain, GluC and trypsin",119,31951383,"MaxQuant score",88.9480000,,,,,,
MEGFLTDQQR,nta,M,1,true,"Arabidopsis translation initiation landscape - NTA",167a,35069635,,,,,,,,
ASGASNAVKHR,ac,K,54,true,"Quantitative Acetylproteomics",101,29440448,,,,,,,,
SHAGRSIRSK,ph,S,58,true,"SIRK1 phosphorylation",86a,23820729,"MaxQuant Score",87.8470000,1.0000000,,,,0.19200000166893,4.3260000
LIDTDGDYHIDPNDPNYDSGEEPFELVGATLSDPLDDYKK,ph,Y,96,true,"Brassinosteroid-Regulated Phosphorylation Dynamics",94,26187819,"MaxQuant Score",101.2000000,0.8480000,,,,6.5489998949016E-14,0.9900000
LIDTDGDYHIDPNDPNYDSGEEPFELVGATLSDPLDDYK,ph,Y,96,true,"Lateral root-induction - NAA vs control",106,23328941,"MASCOT Score",22.0000000,,,,,,
LIDTDGDYHIDPNDPNYDSGEEPFELVGATLSDPLDDYKK,ph,S,98,true,"Arabidopsis root NAA phosphoproteome",18a,27643528,"MaxQuant Score",96.7030000,0.9510000,,,,5.1319998326926E-15,-0.7230000
LIDTDGDYHIDPNDPNYDSGEEPFELVGATLSDPLDDYKK,ph,S,98,true,"PAMP-triggered phosphorylation",48,24601666,"MASCOT Score",35.0900000,,,,,,
LIDTDGDYHIDPNDPNYDSGEEPFELVGATLSDPLDDYKK,ph,S,98,true,"Brassinosteroid-Regulated Phosphorylation Dynamics",94,26187819,"MaxQuant Score",118.7600000,0.9720000,,,,2.5239999478185E-27,0.4520000
LIDTDGDYHIDPNDPNYDSGEEPFELVGATLSDPLDDYKK,ph,S,98,true,"TOR Kinase and ABA Receptor",100,29290610,XCorr,6.1978879,0.9646000,,,,1.8350000630107E-8,
LIDTDGDYHIDPNDPNYDSGEEPFELVGATLSDPLDDYKK,ph,S,98,true,"Tissue atlas Arabidopsis - ProteomicsDB",114,32188942,"MaxQuant score",297.3900000,1.0000000,,,,0,
IADILNEYVETGETYEACR,sno,C,302,true,"hot5-4 / wildtype, FAT-switch S-nitrosoproteome",169,37277371,,,,,,,,
IADILNEYVETGETYEACR,so,C,302,true,"Arabidopsis S-sulfenylation chemoproteomics",108,31578252,"pFind PSM Score",0.3021280,,,,,,-0.6658648
LLNEAASENLISSSQMVK,ph,S,351,true,"Tissue atlas Arabidopsis - ProteomicsDB",114,32188942,"MaxQuant score",297.7000000,0.9234560,,,,0,
LRESLDDLALDIPSAR,ph,S,363,true,"Tissue atlas Arabidopsis - ProteomicsDB",114,32188942,"MaxQuant score",56.9590000,0.9973010,,,,0.00051251397235319,
ISNLLEEYESSGLVSEACK,ox,C,599,true,"SPEAR - 10 mM H2O2 / mock",138a,34619326,,,,2.2441899,0.0319036,YES,,
ISNLLEEYESSGLVSEACK,ox,C,599,true,"SPEAR - 50 mM H2O2 / mock",138b,34619326,,,,1.7623251,0.0446085,YES,,
ISNLLEEYESSGLVSEACK,sno,C,599,true,"hot5-4 / wildtype, FAT-switch S-nitrosoproteome",169,37277371,,,,,,,,
