Peptide,PTM,ModifiedAA,ModifiedPosition,PeptideUniqueToGene,ExperimentDesc,ExpID,PubmedID,ScoreType,IdentScore,LocProb,Log2FChange,PQ-val,QuantSig,PEP,MassErrorPPM
GTLSWGSK,ph,S,57,true,"srk2dei ABA signaling phopshoproteomics",83,23572148,"MASCOT Score",34.0000000,,,,,,0.0004000
GTLSWGSK,ph,S,57,true,"atm and atr DNA damage response",88,25561503,"MASCOT Score",36.0000000,0.9340000,,,,,-2.2100000
GTLSWGSK,ph,S,57,true,"TOR Kinase and ABA Receptor",100,29290610,XCorr,2.7377353,1.0000000,,,,0.0018870000494644,
GTLSWGSK,ph,S,57,true,"Tissue atlas Arabidopsis - ProteomicsDB",114,32188942,"MaxQuant score",121.8000000,0.9999690,,,,0.0029692000243813,
SSLNAWGTSSLSPR,ph,S,70,true,"Lateral root-induction - NAA vs control",106,23328941,"MASCOT Score",22.0000000,,,,,,
SSLNAWGTSSLSPR,ph,S,71,true,"Lateral root-induction - NAA vs control",106,23328941,"MASCOT Score",25.0000000,,,,,,
SSLNAWGTSSLSPR,ph,S,71,true,"Tissue atlas Arabidopsis - ProteomicsDB",114,32188942,"MaxQuant score",281.6500000,0.8255420,,,,0,
SSLNAWGTSSLSPR,ph,S,73,true,"STN8 phosphoproteome",38,21768351,"MASCOT Score",58.5900000,,,,,,-1.2252300
SSLNAWGTSSLSPR,ph,S,73,true,"srk2dei ABA signaling phopshoproteomics",83,23572148,"MASCOT Score",76.0000000,,,,,,-0.0005000
SSLNAWGTSSLSPR,ph,S,73,true,"SnRK2 protein kinase substrates",85,23776212,XCorr,3.1548421,1.0000000,,,,4.9233900289991E-10,
SSLNAWGTSSLSPR,ph,S,73,true,"Lateral root-induction - NAA vs control",106,23328941,"MASCOT Score",54.0000000,,,,,,
SSLNAWGTSSLSPR,ph,S,73,true,"Col-0 callus - FC Col-0 vs. Col-0 Xray",111a,31410901,,76.1800000,,1.1581660,0.0295161,YES,,0.8120537
SSLNAWGTSSLSPR,ph,S,73,true,"Col-0 X-ray callus - FC Col-0 vs. Col-0 Xray",111b,31410901,,76.1800000,,1.1581660,0.0295161,YES,,0.8120537
SSLNAWGTSSLSPR,ph,S,73,true,"atm callus - FC atm vs. atm Xray",111c,31410901,,76.1800000,,0.0466846,0.9085130,NO,,0.8120537
SSLNAWGTSSLSPR,ph,S,73,true,"atm-3 X-ray callus - FC atm vs. atm Xray",111d,31410901,,76.1800000,,0.0466846,0.9085130,NO,,0.8120537
SSLNAWGTSSLSPR,ph,S,73,true,"Tissue atlas Arabidopsis - ProteomicsDB",114,32188942,"MaxQuant score",289.0900000,0.9921130,,,,0,
TESGPGSPSHLSNRPSSGGSVTRPSTADSNK,ph,S,78,true,"Tissue atlas Arabidopsis - ProteomicsDB",114,32188942,"MaxQuant score",102.4000000,0.8918800,,,,8.2853597419581E-25,
TESGPGSPSHLSNRPSSGGSVTRPSTADSNK,ph,S,82,true,"TOR Kinase and ABA Receptor",100,29290610,XCorr,4.3643813,0.8935000,,,,0.1089999973774,
TESGPGSPSHLSNRPSSGGSVTRPSTADSNK,ph,S,82,true,"Col-0 callus - FC Col-0 vs. Col-0 Xray",111a,31410901,,28.4500000,,-0.7177717,0.0000000,NO,,0.9210032
TESGPGSPSHLSNRPSSGGSVTRPSTADSNK,ph,S,82,true,"Col-0 X-ray callus - FC Col-0 vs. Col-0 Xray",111b,31410901,,28.4500000,,-0.7177717,0.0000000,NO,,0.9210032
TESGPGSPSHLSNRPSSGGSVTRPSTADSNK,ph,S,82,true,"atm callus - FC atm vs. atm Xray",111c,31410901,,28.4500000,,0.7981972,0.0000000,NO,,0.9210032
TESGPGSPSHLSNRPSSGGSVTRPSTADSNK,ph,S,82,true,"atm-3 X-ray callus - FC atm vs. atm Xray",111d,31410901,,28.4500000,,0.7981972,0.0000000,NO,,0.9210032
TESGPGSPSHLSNRPSSGGSVTR,ph,S,82,true,"atm and atr DNA damage response",88,25561503,"MASCOT Score",32.0000000,1.0000000,,,,,-1.4600000
TESGPGSPSHLSNRPSSGGSVTR,ph,S,82,true,"Tissue atlas Arabidopsis - ProteomicsDB",114,32188942,"MaxQuant score",193.5400000,0.9998630,,,,0,
TESGPGSPSHLSNRPSSGGSVTRPSTADSNK,ph,S,91,true,"Tissue atlas Arabidopsis - ProteomicsDB",114,32188942,"MaxQuant score",193.5400000,0.8317500,,,,0,
PHSADTRPGSSQLSR,ph,S,143,true,"atm and atr DNA damage response",88,25561503,"MASCOT Score",27.0000000,0.9040000,,,,,0.4400000
PHSADTRPGSSQLSR,ph,S,143,true,"Tissue atlas Arabidopsis - ProteomicsDB",114,32188942,"MaxQuant score",176.4800000,0.9999960,,,,0,
PHSADTRPGSSQLSR,ph,S,150,true,"Tissue atlas Arabidopsis - ProteomicsDB",114,32188942,"MaxQuant score",76.7610000,0.8144560,,,,8.2470702182036E-5,
FAEPVSETSATWGQHVAPEK,ph,S,161,true,"Tissue atlas Arabidopsis - ProteomicsDB",114,32188942,"MaxQuant score",85.5730000,0.7729940,,,,1.2471100490075E-6,
SVEGQGVDCTEEANDR,ph,S,239,true,"STN8 phosphoproteome",38,21768351,"MASCOT Score",100.6500000,,,,,,
SVEGQGVDCTEEANDR,ph,S,239,true,"LAXIC - ABA stress",84a,23660473,XCorr,4.0100000,1.0000000,,,,9.3399998149835E-5,
SVEGQGVDCTEEANDR,ph,S,239,true,"LAXIC - mannitol vs control",84b,23660473,XCorr,4.8300000,1.0000000,-1.0839827,,NO,5.9500002147495E-11,
SVEGQGVDCTEEANDR,ph,S,239,true,"SnRK2 protein kinase substrates",85,23776212,XCorr,3.8819158,1.0000000,,,,0.0005741540226154,
SVEGQGVDCTEEANDR,ph,S,239,true,"atm and atr DNA damage response",88,25561503,"MASCOT Score",95.0000000,1.0000000,,,,,0.1200000
SVEGQGVDCTEEANDR,ph,S,239,true,"Protein sumoylation and phosphorylation cross-talk",97,28419593,,,,,,,,
SVEGQGVDCTEEANDR,ph,S,239,true,"Lateral root-induction - NAA vs control",106,23328941,"MASCOT Score",53.0000000,,,,,,
SVEGQGVDCTEEANDR,ph,S,239,true,"Phospho cell culture sucrose/TOR",109,30833711,,,1.0000000,,,,,
SVEGQGVDCTEEANDR,ph,S,239,true,"Col-0 callus - FC Col-0 vs. Col-0 Xray",111a,31410901,,91.6400000,,-1.1798086,0.0000000,NO,,1.1750667
SVEGQGVDCTEEANDR,ph,S,239,true,"Col-0 X-ray callus - FC Col-0 vs. Col-0 Xray",111b,31410901,,91.6400000,,-1.1798086,0.0000000,NO,,1.1750667
SVEGQGVDCTEEANDR,ph,S,239,true,"atm callus - FC atm vs. atm Xray",111c,31410901,,91.6400000,,0.0326267,0.0000000,NO,,1.1750667
SVEGQGVDCTEEANDR,ph,S,239,true,"atm-3 X-ray callus - FC atm vs. atm Xray",111d,31410901,,91.6400000,,0.0326267,0.0000000,NO,,1.1750667
SVEGQGVDCTEEANDR,ph,S,239,true,"Tissue atlas Arabidopsis - ProteomicsDB",114,32188942,"MaxQuant score",311.0800000,1.0000000,,,,0,
ENQPYSEDAPR,ph,S,269,true,"Tissue atlas Arabidopsis - ProteomicsDB",114,32188942,"MaxQuant score",72.0890000,0.9857720,,,,0.0023559399414808,
NESSHSQETQRPYK,ph,S,443,true,"atm and atr DNA damage response",88,25561503,"MASCOT Score",28.0000000,0.9950000,,,,,-0.2600000
NESSHSQETQRPYK,ph,S,443,true,"Tissue atlas Arabidopsis - ProteomicsDB",114,32188942,"MaxQuant score",125.5200000,0.9915260,,,,9.7380398074165E-6,
NESSHSQETQRPYK,ph,S,446,true,"Tissue atlas Arabidopsis - ProteomicsDB",114,32188942,"MaxQuant score",69.9400000,0.9372090,,,,0.0003187750116922,
FGEDNAKR,ub,K,470,true,"Arabidopsis ubiquitination COFRADIC",40,26744219,"MaxQuant Score",144.3800000,1.0000000,,,,3.3799999073381E-5,-0.1680000
IAQQMQTSR,ph,T,491,true,"Tissue atlas Arabidopsis - ProteomicsDB",114,32188942,"MaxQuant score",119.3400000,0.7715790,,,,0.00082787498831749,
NDASGEVQPVKAELAAPGDPSLIQK,ph,S,504,true,"Tissue atlas Arabidopsis - ProteomicsDB",114,32188942,"MaxQuant score",134.1300000,1.0000000,,,,6.461419940762E-13,
TLNSGNSANKVSAR,ub,K,566,true,"Arabidopsis ubiquitination COFRADIC",40,26744219,"MaxQuant Score",164.7000000,1.0000000,,,,0,0.6280000
TLNSGNSANKVSAR,ph,S,568,true,"Tissue atlas Arabidopsis - ProteomicsDB",114,32188942,"MaxQuant score",91.6160000,0.9997450,,,,0.00040291401091963,
TGHASDSKNSSHYNQGDSATNK,ph,S,580,true,"Tissue atlas Arabidopsis - ProteomicsDB",114,32188942,"MaxQuant score",244.9000000,0.9981970,,,,0,
IVNSEGNDAWQK,ph,S,629,true,"Tissue atlas Arabidopsis - ProteomicsDB",114,32188942,"MaxQuant score",154.7200000,1.0000000,,,,1.202379973364E-9,
TTVMSGSSHTTLATNTESFR,ph,S,645,true,"Tissue atlas Arabidopsis - ProteomicsDB",114,32188942,"MaxQuant score",196.3100000,0.8172460,,,,0,
EVNVDDSLDTESIR,ph,T,667,true,"Tissue atlas Arabidopsis - ProteomicsDB",114,32188942,"MaxQuant score",192.4000000,0.9144680,,,,5.0791399379256E-31,
RPGSGISADPK,ph,S,675,true,"atm and atr DNA damage response",88,25561503,"MASCOT Score",31.0000000,1.0000000,,,,,-0.2200000
RPGSGISADPK,ph,S,675,true,"Lateral root-induction - NAA vs control",106,23328941,"MASCOT Score",37.0000000,,,,,,
RPGSGISADPK,ph,S,675,true,"Phospho cell culture sucrose/TOR",109,30833711,,,0.9975590,,,,,
RPGSGISADPK,ph,S,675,true,"Tissue atlas Arabidopsis - ProteomicsDB",114,32188942,"MaxQuant score",124.0700000,1.0000000,,,,1.2315599633439E-5,
RPGSGISADPK,ph,S,678,true,"Lateral root-induction - NAA vs control",106,23328941,"MASCOT Score",28.0000000,,,,,,
RPGSGISADPK,ph,S,678,true,"Tissue atlas Arabidopsis - ProteomicsDB",114,32188942,"MaxQuant score",60.3450000,1.0000000,,,,0.0066709402017295,
AKALAKLEELNR,ub,K,714,true,"Arabidopsis ubiquitination COFRADIC",40,26744219,"MaxQuant Score",69.3450000,1.0000000,,,,0.00043529999675229,0.0490000
AKALAKLEELNR,ub,K,718,true,"Arabidopsis ubiquitination COFRADIC",40,26744219,"MaxQuant Score",74.9870000,1.0000000,,,,0.00010669999755919,0.4160000
RSQIYEEGSVK,ph,S,733,true,"TOR Kinase and ABA Receptor",100,29290610,XCorr,2.6009500,0.9979000,,,,0.020649999380112,
SQIYEEGSVK,ph,S,733,true,"atm and atr DNA damage response",88,25561503,"MASCOT Score",57.0000000,0.9940000,,,,,0.0400000
SQIYEEGSVK,ph,S,733,true,"Tissue atlas Arabidopsis - ProteomicsDB",114,32188942,"MaxQuant score",142.8300000,1.0000000,,,,5.9713897826441E-7,
NMEAASNASPADMPTDPGSHSSNATNSVEPTGGSGK,ph,S,744,true,"Tissue atlas Arabidopsis - ProteomicsDB",114,32188942,"MaxQuant score",138.1500000,0.9980480,,,,0,
VAVGKETKSGDESIETAR,ub,K,894,true,"Arabidopsis ubiquitination COFRADIC",40,26744219,"MaxQuant Score",125.7300000,0.9980000,,,,3.7740000906134E-35,0.1610000
VAVGKETKSGDESIETAR,ub,K,897,true,"Arabidopsis ubiquitination COFRADIC",40,26744219,"MaxQuant Score",133.9300000,1.0000000,,,,2.3979999808941E-34,-0.1290000
VAVGKETKSGDESIETAR,ph,S,898,true,"Phosphoproteome ethylene-regulated time response",46,24043427,"MASCOT Score",89.9400000,,,,,,-5.2018000
ETKSGDESIETAR,ph,S,898,true,"SnRK2 protein kinase substrates",85,23776212,XCorr,2.2872150,0.8800000,,,,0.10225100070238,
ETKSGDESIETAR,ph,S,898,true,"atm and atr DNA damage response",88,25561503,"MASCOT Score",56.0000000,0.9270000,,,,,0.5100000
SGDESIETAR,ph,S,898,true,"STN8 phosphoproteome",38,21768351,"MASCOT Score",55.0700000,,,,,,-0.7633470
SGDESIETAR,ph,S,898,true,"Tyrosine phosphorylation in Arabidopsis",59,18463617,"MASCOT Score",26.0000000,,,,,,-2.0114702
SGDESIETAR,ph,S,898,true,"Chloroplast kinase substrates",60,19376835,"MASCOT Score",67.9700000,,,,,,0.0049042
SGDESIETAR,ph,S,898,true,"LAXIC - mannitol vs control",84b,23660473,XCorr,4.1500000,1.0000000,,,,2.5099999856337E-10,
SGDESIETAR,ph,S,898,true,"SnRK2 protein kinase substrates",85,23776212,XCorr,3.3937292,1.0000000,,,,1.0480599712537E-6,
SGDESIETAR,ph,S,898,true,"atm and atr DNA damage response",88,25561503,"MASCOT Score",54.0000000,1.0000000,,,,,0.3600000
SGDESIETAR,ph,S,898,true,"Protein sumoylation and phosphorylation cross-talk",97,28419593,,,,,,,,
SGDESIETAR,ph,S,898,true,"TOR Kinase and ABA Receptor",100,29290610,XCorr,4.0295515,1.0000000,,,,2.1180001112953E-6,
SGDESIETAR,ph,S,898,true,"Lateral root-induction - NAA vs control",106,23328941,"MASCOT Score",26.0000000,,,,,,
SGDESIETAR,ph,S,898,true,"Phospho cell culture sucrose/TOR",109,30833711,,,1.0000000,,,,,
SGDESIETAR,ph,S,898,true,"Tissue atlas Arabidopsis - ProteomicsDB",114,32188942,"MaxQuant score",206.9700000,1.0000000,,,,1.349230028915E-21,
ETKSGDESIETAR,ph,S,902,true,"atm and atr DNA damage response",88,25561503,"MASCOT Score",31.0000000,1.0000000,,,,,-0.0800000
SGDESIETAR,ph,S,902,true,"Tissue atlas Arabidopsis - ProteomicsDB",114,32188942,"MaxQuant score",153.7400000,1.0000000,,,,9.633199624659E-7,
SGDESIETAR,ph,T,905,true,"Tissue atlas Arabidopsis - ProteomicsDB",114,32188942,"MaxQuant score",164.4800000,0.9990630,,,,1.0011300446422E-6,
VSGDSSEQISSFTNEESQNR,ph,S,931,true,"Tissue atlas Arabidopsis - ProteomicsDB",114,32188942,"MaxQuant score",208.5900000,0.8998750,,,,0,
VSGDSSEQISSFTNEESQNR,ph,S,943,true,"Tissue atlas Arabidopsis - ProteomicsDB",114,32188942,"MaxQuant score",84.3780000,0.9955120,,,,5.3863400353293E-6,
NSLVNKPAEK,ph,S,963,true,"Tissue atlas Arabidopsis - ProteomicsDB",114,32188942,"MaxQuant score",97.2760000,1.0000000,,,,0.00094569497741759,
ADVSTGGGSQTTVPEFGTSSK,ph,S,992,true,"Tissue atlas Arabidopsis - ProteomicsDB",114,32188942,"MaxQuant score",58.1070000,0.7540300,,,,0.00044796298607253,
ADVSTGGGSQTTVPEFGTSSK,ph,S,997,true,"Tissue atlas Arabidopsis - ProteomicsDB",114,32188942,"MaxQuant score",171.2900000,0.9946950,,,,4.2128299822999E-36,
NLVTSAPDMSENVNQK,ph,S,1049,true,"Tissue atlas Arabidopsis - ProteomicsDB",114,32188942,"MaxQuant score",142.9100000,0.9966220,,,,9.144550117135E-10,
GGEGTGILQPSGSTAGK,ph,S,1076,true,"Tissue atlas Arabidopsis - ProteomicsDB",114,32188942,"MaxQuant score",208.0700000,0.9639120,,,,0,
EHASWHQR,ph,S,1103,true,"Tissue atlas Arabidopsis - ProteomicsDB",114,32188942,"MaxQuant score",110.4700000,1.0000000,,,,0.001000770018436,
GSGAPTKALEDGQFVTSNQPIR,ub,K,1114,true,"Arabidopsis ubiquitination COFRADIC",40,26744219,"MaxQuant Score",83.8710000,1.0000000,,,,4.2329998495121E-23,-1.3760000
AHTQHSGHGFSQPDLPAASK,ph,S,1223,true,"Tissue atlas Arabidopsis - ProteomicsDB",114,32188942,"MaxQuant score",156.7300000,0.9985040,,,,2.8498099739188E-29,
AHTQHSGHGFSQPDLPAASK,ph,S,1228,true,"Tissue atlas Arabidopsis - ProteomicsDB",114,32188942,"MaxQuant score",106.9900000,0.9899850,,,,7.3002402734001E-12,
VPGDHVWHTANRTGK,ph,T,1253,true,"Tissue atlas Arabidopsis - ProteomicsDB",114,32188942,"MaxQuant score",57.1710000,0.9208380,,,,0.0016639600507915,
DKPYGSQEK,ph,S,1269,true,"atm and atr DNA damage response",88,25561503,"MASCOT Score",23.0000000,1.0000000,,,,,-2.0400000
TTSADTQAQLQNR,ph,S,1290,true,"Tissue atlas Arabidopsis - ProteomicsDB",114,32188942,"MaxQuant score",104.4100000,0.9920310,,,,0.00017959700198844,
STNKEVQVEQNPNSMFQKNTGQGR,ub,K,1304,true,"Arabidopsis ubiquitination COFRADIC",40,26744219,"MaxQuant Score",50.2710000,1.0000000,,,,1.4289999853645E-5,-0.6340000
QNLHYEYKPVGSHTYDGER,ph,S,1371,true,"Tissue atlas Arabidopsis - ProteomicsDB",114,32188942,"MaxQuant score",133.4100000,0.8437330,,,,1.2330500017571E-15,
EQSKESSQTEGPR,ub,K,1384,true,"Arabidopsis ubiquitination COFRADIC",40,26744219,"MaxQuant Score",42.7850000,1.0000000,,,,0.0020000000949949,0.0810000
