Peptide,PTM,ModifiedAA,ModifiedPosition,PeptideUniqueToGene,ExperimentDesc,ExpID,PubmedID,ScoreType,IdentScore,LocProb,Log2FChange,PQ-val,QuantSig,PEP,MassErrorPPM
SVARDISHADSKKE,nta,S,53,true,"Arabidopsis translation initiation landscape - NTA",167a,35069635,,,,,,,,
ELLKDPDALWKR,ac,K,76,true,"Quantitative Acetylproteomics",101,29440448,,,,,,,,
SIANPDEGRMV,nt,S,125,true,"N-terminal ChaFRADIC",92,26010716,"MASCOT Score",21.2700000,,,,,1.9510000583978E-6,
TLIENTLDSICAFSDDIISGK,sno,C,163,true,"hot5-4 / wildtype, FAT-switch S-nitrosoproteome",169,37277371,,,,1.0957527,0.0001220,YES,,
IKPPSSPEGR,ac,K,175,true,"Quantitative Acetylproteomics",101,29440448,,,,,,,,
IKPPSSPEGR,ph,S,179,true,"atm and atr DNA damage response",88,25561503,"MASCOT Score",29.0000000,0.9950000,,,,,-3.0900000
IKPPSSPEGR,ph,S,179,true,"Tissue atlas Arabidopsis - ProteomicsDB",114,32188942,"MaxQuant score",118.3700000,0.8767730,,,,4.3212701712037E-5,
AAAEVLALQKR,ac,K,537,true,"Quantitative Acetylproteomics",101,29440448,,,,,,,,
VLSVLNEATCK,ox,C,548,true,"Bicarbonate Induced Redox Changes - 30 min",117b,28184230,,,,0.4646683,,YES,,
VLSVLNEATCK,ox,C,548,true,"SPEAR - 50 mM H2O2 / mock",138b,34619326,,,,0.5653146,0.0165556,YES,,
VLSVLNEATCKDPVEPLTLEEIADR,sno,C,548,true,"hot5-4 / wildtype, FAT-switch S-nitrosoproteome",169,37277371,,,,,,,,
VLSVLNEATCK,sno,C,548,true,"hot5-4 / wildtype, FAT-switch S-nitrosoproteome",169,37277371,,,,0.2747444,0.0003590,NO,,
VLSVLNEATCK,so,C,548,true,"Arabidopsis S-sulfenylation chemoproteomics",108,31578252,"pFind PSM Score",0.0958683,,1.3513500,,,,-0.0884145
VLIAEGNCGSPR,ox,C,593,true,"OxiTRAQ Arabidopsis - 5 mM H2O2 versus control",47,24376095,,,,1.3605057,0.0032564,YES,,
VLIAEGNCGSPR,sno,C,593,true,"hot5-4 / wildtype, FAT-switch S-nitrosoproteome",169,37277371,,,,0.8582357,0.0071788,YES,,
VLIAEGNCGSPR,ph,S,595,true,"Arabidopsis root NAA phosphoproteome",18a,27643528,"MaxQuant Score",72.8980000,1.0000000,,,,1.7470000557296E-6,-0.3720000
VLIAEGNCGSPR,ph,S,595,true,"STN8 phosphoproteome",38,21768351,"MASCOT Score",85.7500000,,,,,,
VLIAEGNCGSPR,ph,S,595,true,"Large-scale phosphorylation discovery",44,23111157,XCorr,3.7170000,,,,,,
VLIAEGNCGSPR,ph,S,595,true,"Tyrosine phosphorylation in Arabidopsis",59,18463617,"MASCOT Score",78.0000000,,,,,,-0.8138536
VLIAEGNCGSPR,ph,S,595,true,"Chloroplast kinase substrates",60,19376835,"MASCOT Score",80.7000000,,,,,,-0.5137240
VLIAEGNCGSPR,ph,S,595,true,"Conserved plant phosphoproteome - Arabidopsis",61a,20466843,"MASCOT Score",78.0000000,1.0000000,,,,,
VLIAEGNCGSPR,ph,S,595,true,"srk2dei ABA signaling phopshoproteomics",83,23572148,"MASCOT Score",85.0000000,,,,,,0.0002000
VLIAEGNCGSPR,ph,S,595,true,"LAXIC - ABA stress",84a,23660473,XCorr,3.2000000,1.0000000,,,,0.015545399859548,
VLIAEGNCGSPR,ph,S,595,true,"LAXIC - mannitol vs control",84b,23660473,XCorr,3.5500000,1.0000000,,,,1.1700000186465E-6,
VLIAEGNCGSPR,ph,S,595,true,"SnRK2 protein kinase substrates",85,23776212,XCorr,3.2502227,1.0000000,,,,0.0002082029968733,
VLIAEGNCGSPR,ph,S,595,true,"atm and atr DNA damage response",88,25561503,"MASCOT Score",73.0000000,1.0000000,,,,,0.3100000
VLIAEGNCGSPR,ph,S,595,true,"TOR Kinase and ABA Receptor",100,29290610,XCorr,4.3570080,1.0000000,,,,6.4129999373108E-6,
VLIAEGNCGSPR,ph,S,595,true,"Lateral root-induction - NAA vs control",106,23328941,"MASCOT Score",51.0000000,,-0.0939001,0.5973048,NO,,
VLIAEGNCGSPR,ph,S,595,true,"Phospho cell culture sucrose/TOR",109,30833711,,,1.0000000,,,,,
VLIAEGNCGSPR,ph,S,595,true,"Col-0 callus - FC Col-0 vs. Col-0 Xray",111a,31410901,,63.8000000,,0.2722035,0.0000000,NO,,0.2265130
VLIAEGNCGSPR,ph,S,595,true,"Col-0 X-ray callus - FC Col-0 vs. Col-0 Xray",111b,31410901,,63.8000000,,0.2722035,0.0000000,NO,,0.2265130
VLIAEGNCGSPR,ph,S,595,true,"atm callus - FC atm vs. atm Xray",111c,31410901,,63.8000000,,0.1247700,0.0000000,NO,,0.2265130
VLIAEGNCGSPR,ph,S,595,true,"atm-3 X-ray callus - FC atm vs. atm Xray",111d,31410901,,63.8000000,,0.1247700,0.0000000,NO,,0.2265130
VLIAEGNCGSPR,ph,S,595,true,"Tissue atlas Arabidopsis - ProteomicsDB",114,32188942,"MaxQuant score",207.0400000,1.0000000,,,,6.6739100839969E-31,
VYLGECNVDDLYA,sno,C,606,true,"hot5-4 / wildtype, FAT-switch S-nitrosoproteome",169,37277371,,,,0.5203742,0.0028477,NO,,
