Peptide,PTM,ModifiedAA,ModifiedPosition,PeptideUniqueToGene,ExperimentDesc,ExpID,PubmedID,ScoreType,IdentScore,LocProb,Log2FChange,PQ-val,QuantSig,PEP,MassErrorPPM
AALENALTQAPSASHVMGQNGIFR,ph,S,173,true,"Tissue atlas Arabidopsis - ProteomicsDB",114,32188942,"MaxQuant score",147.5500000,0.9719670,,,,1.63951920326E-43,
YADSIDPDDHK,ph,S,482,true,"Tissue atlas Arabidopsis - ProteomicsDB",114,32188942,"MaxQuant score",152.4000000,1.0000000,,,,7.8911197576303E-9,
INDNLSTESKSPK,ph,S,495,true,"Tissue atlas Arabidopsis - ProteomicsDB",114,32188942,"MaxQuant score",166.5600000,0.9634580,,,,5.4766998905777E-15,
INDNLSTESKSPKR,ph,T,496,true,"Tissue atlas Arabidopsis - ProteomicsDB",114,32188942,"MaxQuant score",103.4000000,0.8151370,,,,0.00033771200105548,
INDNLSTESKSPK,ph,S,498,true,"Tissue atlas Arabidopsis - ProteomicsDB",114,32188942,"MaxQuant score",128.7400000,0.9925630,,,,4.0961200284073E-5,
INDNLSTESKSPK,ph,S,500,true,"Tissue atlas Arabidopsis - ProteomicsDB",114,32188942,"MaxQuant score",251.0700000,0.9999970,,,,0,
RSSLPR,ph,S,518,false,"SnRK2 protein kinase substrates",85,23776212,XCorr,2.0948699,0.9990000,,,,0.10655999928713,
NSSTSDVASDTQKPSK,ph,S,556,true,"Tissue atlas Arabidopsis - ProteomicsDB",114,32188942,"MaxQuant score",130.4100000,0.9447440,,,,1.6084899262632E-36,
NSSTSDVASDTQKPSK,ph,S,558,true,"Tissue atlas Arabidopsis - ProteomicsDB",114,32188942,"MaxQuant score",133.7900000,0.8339510,,,,1.1434595468891E-42,
NSSTSDVASDTQKPSK,ph,S,562,true,"Tissue atlas Arabidopsis - ProteomicsDB",114,32188942,"MaxQuant score",155.1100000,0.9605650,,,,2.9172600750013E-13,
NSSTSDVASDTQKPSKLSDAPGGSK,ph,S,568,true,"Tissue atlas Arabidopsis - ProteomicsDB",114,32188942,"MaxQuant score",84.0670000,0.8584190,,,,1.4645799763929E-12,
LSDAPGGSKR,ph,S,577,true,"Tissue atlas Arabidopsis - ProteomicsDB",114,32188942,"MaxQuant score",149.2300000,1.0000000,,,,6.1661899053433E-7,
LESTKLELQSR,ph,S,613,true,"Tissue atlas Arabidopsis - ProteomicsDB",114,32188942,"MaxQuant score",181.6700000,0.9953770,,,,8.0120900690893E-14,
SNAVLQASLER,ph,S,635,true,"Tissue atlas Arabidopsis - ProteomicsDB",114,32188942,"MaxQuant score",111.8300000,1.0000000,,,,3.2490101148142E-5,
KLALETGLNMSK,ph,S,678,true,"Tissue atlas Arabidopsis - ProteomicsDB",114,32188942,"MaxQuant score",131.3600000,0.9996970,,,,2.7060299544246E-5,
DTEAASTHISER,ph,S,759,true,"Tissue atlas Arabidopsis - ProteomicsDB",114,32188942,"MaxQuant score",164.9300000,0.8506850,,,,3.6078100142806E-12,
GSSKLVGLSK,ph,S,800,true,"Tissue atlas Arabidopsis - ProteomicsDB",114,32188942,"MaxQuant score",113.6100000,0.9612470,,,,0.0003639509959612,
LVGLSKR,ph,S,806,true,"Tissue atlas Arabidopsis - ProteomicsDB",114,32188942,"MaxQuant score",86.1360000,1.0000000,,,,0.015945399180055,
SGTKGEGSTTTTSALSK,ph,S,809,true,"Tissue atlas Arabidopsis - ProteomicsDB",114,32188942,"MaxQuant score",203.2300000,0.9548800,,,,0,
SGTKGEGSTTTTSALSK,ph,T,811,true,"Tissue atlas Arabidopsis - ProteomicsDB",114,32188942,"MaxQuant score",221.9900000,0.9789630,,,,0,
GEGSTTTTSALSK,ph,S,816,true,"Tissue atlas Arabidopsis - ProteomicsDB",114,32188942,"MaxQuant score",185.2000000,0.9543630,,,,4.4060701261013E-22,
SQIANELQNMDK,ph,S,838,true,"Tissue atlas Arabidopsis - ProteomicsDB",114,32188942,"MaxQuant score",254.1000000,1.0000000,,,,0,
TLGQPSPTSGQNR,ph,S,857,true,"Large-scale phosphorylation discovery",44,23111157,XCorr,4.2320000,,,,,,
TLGQPSPTSGQNR,ph,S,857,true,"Lateral root-induction - NAA vs control",106,23328941,"MASCOT Score",39.0000000,,,,,,
TLGQPSPTSGQNR,ph,S,857,true,"Tissue atlas Arabidopsis - ProteomicsDB",114,32188942,"MaxQuant score",145.6100000,0.9987640,,,,1.2347099982435E-6,
TLGQPSPTSGQNRVSEETEK,ph,S,866,true,"Tissue atlas Arabidopsis - ProteomicsDB",114,32188942,"MaxQuant score",81.4410000,0.9844480,,,,1.5447099940502E-5,
VSEETEKGSGSNQDPDSSK,ph,S,873,true,"Tissue atlas Arabidopsis - ProteomicsDB",114,32188942,"MaxQuant score",81.2260000,0.8952390,,,,0.00013833299453836,
GSGSNQDPDSSKLQSPHILDR,ph,S,881,true,"Tissue atlas Arabidopsis - ProteomicsDB",114,32188942,"MaxQuant score",246.3100000,0.9572820,,,,0,
LQSPHILDR,ph,S,886,true,"Pollen phosphoproteome Arabidopsis",43,22631563,"MASCOT Score",47.3300000,,,,,,-1.0722800
LQSPHILDR,ph,S,886,true,"Tissue atlas Arabidopsis - ProteomicsDB",114,32188942,"MaxQuant score",246.3100000,1.0000000,,,,0,
GRGSSGGNHPNTTPR,ph,S,905,true,"Tissue atlas Arabidopsis - ProteomicsDB",114,32188942,"MaxQuant score",63.8690000,0.9064890,,,,0.0014182400191203,
GSSGGNHPNTTPR,ph,T,914,true,"Tissue atlas Arabidopsis - ProteomicsDB",114,32188942,"MaxQuant score",155.3800000,0.9974050,,,,2.0180599413777E-9,
