Peptide,PTM,ModifiedAA,ModifiedPosition,PeptideUniqueToGene,ExperimentDesc,ExpID,PubmedID,ScoreType,IdentScore,LocProb,Log2FChange,PQ-val,QuantSig,PEP,MassErrorPPM
SYIFNEPIVVSPAR,ph,S,145,true,"Pollen phosphoproteome Arabidopsis",43,22631563,"MASCOT Score",92.3900000,,,,,,-1.6501400
SYIFNEPIVVSPAR,ph,S,145,true,"Conserved plant phosphoproteome - Arabidopsis",61a,20466843,"MASCOT Score",31.0000000,1.0000000,,,,,
SYIFNEPIVVSPAR,ph,S,145,true,"LAXIC - mannitol vs control",84b,23660473,XCorr,3.1400000,1.0000000,,,,0.00028902699705213,
SYIFNEPIVVSPAR,ph,S,145,true,"SnRK2 protein kinase substrates",85,23776212,XCorr,3.3935246,1.0000000,,,,5.4680298489984E-5,
SYIFNEPIVVSPAR,ph,S,145,true,"TOR Kinase and ABA Receptor",100,29290610,XCorr,4.8702192,1.0000000,,,,4.9209997996513E-6,
SYIFNEPIVVSPAR,ph,S,145,true,"Lateral root-induction - NAA vs control",106,23328941,"MASCOT Score",61.0000000,,,,,,
SYIFNEPIVVSPAR,ph,S,145,true,"Phospho cell culture sucrose/TOR",109,30833711,,,1.0000000,,,,,
SYIFNEPIVVSPAR,ph,S,145,true,"Tissue atlas Arabidopsis - ProteomicsDB",114,32188942,"MaxQuant score",228.9000000,1.0000000,,,,0,
LQPIDPAAIFTQGAKR,ub,K,163,true,"upl3 mutant / wildtype",168,35926874,"MaxQuant score",53.5650000,1.0000000,,,,0.00073895399691537,-0.2956400
SVVANDPGGR,ph,S,173,true,"Tissue atlas Arabidopsis - ProteomicsDB",114,32188942,"MaxQuant score",77.3870000,1.0000000,,,,0.0036134100519121,
SSSGSGVILDDCNFHESVR,so,C,259,true,"Arabidopsis S-sulfenylation chemoproteomics",108,31578252,"pFind PSM Score",0.0000002,,1.4175500,,,,-0.3222041
ASFELEPGAAGQR,ph,S,347,true,"atm and atr DNA damage response",88,25561503,"MASCOT Score",84.0000000,1.0000000,,,,,0.3000000
ASFELEPGAAGQR,ph,S,347,true,"Tissue atlas Arabidopsis - ProteomicsDB",114,32188942,"MaxQuant score",81.4940000,1.0000000,,,,0.00053198699606583,
