Peptide,PTM,ModifiedAA,ModifiedPosition,PeptideUniqueToGene,ExperimentDesc,ExpID,PubmedID,ScoreType,IdentScore,LocProb,Log2FChange,PQ-val,QuantSig,PEP,MassErrorPPM
TSALYASDLFK,nta,T,2,true,"Characterization plant N-terminal acetylation",6,22223895,"MASCOT Score",96.1000000,,,,,,
SLMAKDEDDDLDLGSGKTR,nt,S,66,true,"Arabidopsis translation initiation landscape - NT",167b,35069635,,,,,,,,
DEDDDLDLGSGK,ph,S,80,true,"Pollen phosphoproteome Arabidopsis",43,22631563,"MASCOT Score",69.9400000,,,,,,-2.4099800
DEDDDLDLGSGK,ph,S,80,true,"Large-scale phosphorylation discovery",44,23111157,XCorr,3.4040000,,,,,,
DEDDDLDLGSGK,ph,S,80,true,"atm and atr DNA damage response",88,25561503,"MASCOT Score",94.0000000,1.0000000,,,,,0.7000000
DEDDDLDLGSGK,ph,S,80,true,"Tissue atlas Arabidopsis - ProteomicsDB",114,32188942,"MaxQuant score",236.4200000,1.0000000,,,,0,
VATYGDGEPTDNAAR,nt,V,145,true,"Arg/N-end rule seed, prt6 vs. Wt",99,29168982,"MASCOT Score",43.0000000,,-1.5565909,0.0493534,YES,0.015690000727773,1.1191015
SVATPYTAVIPEYR,ph,S,249,true,"TOR Kinase and ABA Receptor",100,29290610,XCorr,4.0349050,0.9185000,,,,2.2480000552605E-5,
SVATPYTAVIPEYR,ph,S,249,true,"Lateral root-induction - NAA vs control",106,23328941,"MASCOT Score",25.0000000,,,,,,
SVATPYTAVIPEYR,ph,T,252,true,"Lateral root-induction - NAA vs control",106,23328941,"MASCOT Score",20.0000000,,,,,,
SVATPYTAVIPEYR,ph,T,252,true,"Tissue atlas Arabidopsis - ProteomicsDB",114,32188942,"MaxQuant score",232.3700000,1.0000000,,,,0,
FTTQKSMESNVANGNTTIDIHHPCR,ph,T,272,true,"Tissue atlas Arabidopsis - ProteomicsDB",114,32188942,"MaxQuant score",151.2800000,0.8495550,,,,4.9045446251369E-44,
SMESNVANGNTTIDIHHPCR,ph,S,275,true,"Arabidopsis root NAA phosphoproteome",18a,27643528,"MaxQuant Score",70.3450000,0.9800000,,,,1.5639999446648E-6,-2.1290000
SMESNVANGNTTIDIHHPCR,ph,S,275,true,"Phosphoproteome iron-deficient Arabidopsis roots",41,22438062,"MASCOT Score",77.2500000,,,,,,
SMESNVANGNTTIDIHHPCR,ph,S,275,true,"Large-scale phosphorylation discovery",44,23111157,XCorr,3.8020000,,,,,,
SMESNVANGNTTIDIHHPCR,ph,S,275,true,"Tyrosine phosphorylation in Arabidopsis",59,18463617,"MASCOT Score",28.0000000,,,,,,-1.6724066
SMESNVANGNTTIDIHHPCR,ph,S,275,true,"srk2dei ABA signaling phopshoproteomics",83,23572148,"MASCOT Score",88.0000000,,,,,,0.0018000
SMESNVANGNTTIDIHHPCR,ph,S,275,true,"SnRK2 protein kinase substrates",85,23776212,XCorr,3.0539300,0.9400000,,,,0.012850900180638,
SMESNVANGNTTIDIHHPCR,ph,S,275,true,"atm and atr DNA damage response",88,25561503,"MASCOT Score",91.0000000,1.0000000,,,,,-0.1800000
SMESNVANGNTTIDIHHPCR,ph,S,275,true,"TOR Kinase and ABA Receptor",100,29290610,XCorr,2.6843143,0.9991000,,,,3.9649999962421E-5,
SMESNVANGNTTIDIHHPCR,ph,S,275,true,"Phospho cell culture sucrose/TOR",109,30833711,,,0.9999540,,,,,
SMESNVANGNTTIDIHHPCR,ph,S,275,true,"Col-0 callus - FC Col-0 vs. Col-0 Xray",111a,31410901,,29.0700000,,0.4671001,0.0000000,NO,,2.1383758
SMESNVANGNTTIDIHHPCR,ph,S,275,true,"Col-0 X-ray callus - FC Col-0 vs. Col-0 Xray",111b,31410901,,29.0700000,,0.4671001,0.0000000,NO,,2.1383758
SMESNVANGNTTIDIHHPCR,ph,S,275,true,"atm callus - FC atm vs. atm Xray",111c,31410901,,29.0700000,,1.8250263,0.0000000,NO,,2.1383758
SMESNVANGNTTIDIHHPCR,ph,S,275,true,"atm-3 X-ray callus - FC atm vs. atm Xray",111d,31410901,,29.0700000,,1.8250263,0.0000000,NO,,2.1383758
SMESNVANGNTTIDIHHPCR,ph,S,275,true,"Tissue atlas Arabidopsis - ProteomicsDB",114,32188942,"MaxQuant score",271.5800000,1.0000000,,,,0,
FTTQKSMESNVANGNTTIDIHHPCR,ph,S,278,true,"Tissue atlas Arabidopsis - ProteomicsDB",114,32188942,"MaxQuant score",108.6400000,0.8016380,,,,1.3939899714337E-21,
