Peptide,PTM,ModifiedAA,ModifiedPosition,PeptideUniqueToGene,ExperimentDesc,ExpID,PubmedID,ScoreType,IdentScore,LocProb,Log2FChange,PQ-val,QuantSig,PEP,MassErrorPPM
MEGSPVTSVRLSSVVPASVVGEN,nta,M,1,true,"HUNTER N-terminome: legumain, GluC and trypsin",119,31951383,"MaxQuant score",83.5400000,,,,,,
MEGSPVTSVR,nta,M,1,true,"N-term acetylation drought responses",5,26184543,,,,,,,,
MEGSPVTSVR,nta,M,1,true,"Characterization plant N-terminal acetylation",6,22223895,"MASCOT Score",64.4300000,,,,,,
MEGSPVTSVR,nta,M,1,true,"Arg/N-end rule seed, prt6 vs. Wt",99,29168982,"MASCOT Score",76.2400000,,,,,0.0078239999711514,-0.7985117
MEGSPVTSVR,nta,M,1,true,"FtsH12 N-terminome: WT / FtsH12 knockdown miRNA",118,33216923,"MaxQuant score",129.0100000,,,,,8.6880504788139E-44,
MEGSPVTSVR,nta,M,1,true,"HUNTER N-terminome: legumain, GluC and trypsin",119,31951383,"MaxQuant score",85.7310000,,,,,,
MEGSPVTSVR,ph,S,4,true,"atm and atr DNA damage response",88,25561503,"MASCOT Score",42.0000000,0.8960000,,,,,0.0500000
SVVPASVVGE,nt,S,13,true,"Arg/N-end rule seed, prt6 vs. Wt",99,29168982,"MASCOT Score",45.4300000,,-0.6514533,0.0121603,NO,0.0084140002727509,0.0508670
CNDSGIR,sno,C,97,true,"hot5-4 / wildtype, FAT-switch S-nitrosoproteome",169,37277371,,,,,,,,
TPELTSHAR,ph,T,198,true,"atm and atr DNA damage response",88,25561503,"MASCOT Score",34.0000000,1.0000000,,,,,0.3400000
DQPFSEVDILYALIWK,ph,S,259,true,"Ethylene-regulated phosphorylation ein2 mutant",30,19253305,"MASCOT Score",32.2581000,,,,,,-5.0126210
GETNTNVITICDR,ox,C,287,true,"SPEAR - 10 mM H2O2 / mock",138a,34619326,,,,5.2087899,0.0030163,YES,,
GETNTNVITICDR,sno,C,287,true,"hot5-4 / wildtype, FAT-switch S-nitrosoproteome",169,37277371,,,,0.0385236,0.7098235,NO,,
