Peptide,PTM,ModifiedAA,ModifiedPosition,PeptideUniqueToGene,ExperimentDesc,ExpID,PubmedID,ScoreType,IdentScore,LocProb,Log2FChange,PQ-val,QuantSig,PEP,MassErrorPPM
FVEASVVHNTGSER,ph,S,220,true,"Tissue atlas Arabidopsis - ProteomicsDB",114,32188942,"MaxQuant score",80.7460000,0.9999650,,,,0.00046027501230128,
FVEASVVHNTGSER,ph,S,227,true,"atm and atr DNA damage response",88,25561503,"MASCOT Score",76.0000000,0.9240000,,,,,0.3400000
FVEASVVHNTGSER,ph,S,227,true,"Tissue atlas Arabidopsis - ProteomicsDB",114,32188942,"MaxQuant score",182.4900000,0.9861970,,,,9.4991600980838E-23,
FADTSSLGSYANK,ph,T,248,true,"Tissue atlas Arabidopsis - ProteomicsDB",114,32188942,"MaxQuant score",113.3500000,0.9832880,,,,8.1939098890871E-5,
FADTSSLGSYANK,ph,S,249,true,"Tissue atlas Arabidopsis - ProteomicsDB",114,32188942,"MaxQuant score",177.1200000,0.9941340,,,,6.1501198544744E-25,
FADTSSLGSYANKEDYVFMCK,ph,S,250,true,"Phosphorylation Early Elicitor Signaling",23,17317660,,,,,,,,
FADTSSLGSYANK,ph,S,250,true,"Phosphorylation Early Elicitor Signaling",23,17317660,,,,,,,,
FADTSSLGSYANK,ph,S,250,true,"Large-scale phosphorylation discovery",44,23111157,XCorr,5.3530000,,,,,,
FADTSSLGSYANK,ph,S,250,true,"TOR Kinase and ABA Receptor",100,29290610,XCorr,4.2297149,0.8857000,,,,1.3820000503983E-6,
FADTSSLGSYANK,ph,S,250,true,"Tissue atlas Arabidopsis - ProteomicsDB",114,32188942,"MaxQuant score",336.3900000,0.9985360,,,,0,
FADTSSLGSYANKEDYVFMCK,ph,S,253,true,"Tissue atlas Arabidopsis - ProteomicsDB",114,32188942,"MaxQuant score",252.1000000,0.9999970,,,,0,
