Peptide,PTM,ModifiedAA,ModifiedPosition,PeptideUniqueToGene,ExperimentDesc,ExpID,PubmedID,ScoreType,IdentScore,LocProb,Log2FChange,PQ-val,QuantSig,PEP,MassErrorPPM
AEMERTFIAIKPD,nt,A,85,false,"HUNTER N-terminome: legumain, GluC and trypsin",119,31951383,"MaxQuant score",101.5300000,,,,,,
TFIAIKPDGVQR,nt,T,90,false,"Mitochondrial intermediate peptidases - oct1-2 / WT",131c,25732537,,49.2800000,,-0.6189881,,,,
TFIAIKPDGVQR,nta,T,90,false,"Mitochondrial intermediate peptidases - oct1-1 / WT",131b,25732537,,58.6700000,,-0.0086451,,,,
TFIAIKPDGVQR,nta,T,90,false,"Mitochondrial intermediate peptidases - oct1-2 / WT",131c,25732537,,49.2900000,,0.1072116,,,,
TFIAIKPDGVQR,ub,K,95,false,"Arabidopsis ubiquitination COFRADIC",40,26744219,"MaxQuant Score",81.7090000,1.0000000,,,,0.00031000000308268,0.0120000
HYHDLKER,ac,K,139,false,"Histone deacetylases- hda14 vs WT (low light)",98c,29061669,"MaxQuant Score",81.9200000,1.0000000,-4.6410000,0.0891251,NO,0.0099999997764826,
KLIGATDPQKSEPGTIR,ub,K,172,false,"Arabidopsis ubiquitination COFRADIC",40,26744219,"MaxQuant Score",123.4000000,1.0000000,,,,2.7349999484876E-30,1.2840000
LIGATDPQKSEPGTIR,ac,K,181,false,"Histone deacetylases - apicidin vs control",98a,29061669,"MaxQuant Score",195.6000000,1.0000000,0.0490000,0.7620790,NO,0,
LIGATDPQKSEPGTIR,ac,K,181,false,"Histone deacetylases substrates - TSA vs control",98b,29061669,"MaxQuant Score",195.6000000,1.0000000,-0.0050000,0.9977001,NO,0,
LIGATDPQKSEPGTIR,ac,K,181,false,"Histone deacetylases- hda14 vs WT (low light)",98c,29061669,"MaxQuant Score",251.2600000,1.0000000,-0.3410000,0.9885531,NO,4.1000000130014E-29,
LIGATDPQKSEPGTIR,ac,K,181,false,"Histone deacetylases - hda14 vs WT (thylakoids)",98d,29061669,"MaxQuant Score",127.3000000,1.0000000,0.0790000,0.9862795,NO,3.6200001329867E-10,
LIGATDPQKSEPGTIR,ac,K,181,false,"Histone deacetylases substrates - hda14 vs WT",98e,29061669,"MaxQuant Score",159.2000000,1.0000000,0.0410000,0.9484185,NO,0,
KLIGATDPQKSEPGTIR,ub,K,181,false,"Arabidopsis ubiquitination COFRADIC",40,26744219,"MaxQuant Score",123.4000000,1.0000000,,,,2.7349999484876E-30,1.2840000
NIIHGSDGPETAK,ph,S,203,false,"TOR Kinase and ABA Receptor",100,29290610,XCorr,3.4767122,0.9919000,,,,0.00055779999820516,
NIIHGSDGPETAK,ph,S,203,false,"Phospho cell culture sucrose/TOR",109,30833711,,,0.9999950,,,,,
