Peptide,PTM,ModifiedAA,ModifiedPosition,PeptideUniqueToGene,ExperimentDesc,ExpID,PubmedID,ScoreType,IdentScore,LocProb,Log2FChange,PQ-val,QuantSig,PEP,MassErrorPPM
LYQVKAMGKFNLWEVMGGR,ub,K,48,true,"Arabidopsis ubiquitination by TUBEs",2,23667124,,,,,,,,
LYQVKAMGKFNLWEVMGGR,ub,K,48,true,"MudPIT plant ubiquitination",103,17272265,XCorr,2.3800000,,,,,,
GKFNLWEVMGGR,nt,G,51,true,"HUNTER N-terminome: legumain, GluC and trypsin",119,31951383,"MaxQuant score",72.0890000,,,,,,
LYQVKAMGKFNLWEVMGGR,ub,K,52,true,"Arabidopsis ubiquitination by TUBEs",2,23667124,,,,,,,,
NIEDEQETSKAENNETER,ub,K,87,true,"Arabidopsis ubiquitination COFRADIC",40,26744219,"MaxQuant Score",74.7320000,1.0000000,,,,1.2199999691043E-11,0.7600000
ESDDSNLSFKVPEDGFEK,ph,S,103,true,"Chloroplast kinase substrates",60,19376835,"MASCOT Score",40.9300000,,,,,,-0.9534160
EMMGLTGGFPGGEKGLKTFIEK,ub,K,130,true,"Arabidopsis ubiquitination by TUBEs",2,23667124,,,,,,,,
EMMGLTGGFPGGEKGLKTFIEK,ub,K,130,true,"MudPIT plant ubiquitination",103,17272265,XCorr,2.4100000,,,,,,
TFIEKNPPPPPPPPPAK,ac,K,135,true,"Quantitative Acetylproteomics",101,29440448,,,,,,,,
