Peptide,PTM,ModifiedAA,ModifiedPosition,PeptideUniqueToGene,ExperimentDesc,ExpID,PubmedID,ScoreType,IdentScore,LocProb,Log2FChange,PQ-val,QuantSig,PEP,MassErrorPPM
ATSGTYVTEVPLKGSAEKHY,nt,A,2,false,"Stromal N-terminome",96,26371235,"MASCOT Score",46.0800000,,,,,,
ATSGTYVTEVPLKGSAEKHY,nt,A,2,false,"Arg/N-end rule seed, prt6 vs. Wt",99,29168982,"MASCOT Score",33.6200000,,,,,0.00071839999873191,0.7234549
ATSGTYVTEVPLKGSAEKH,nt,A,2,false,"Stromal N-terminome",96,26371235,"MASCOT Score",43.7000000,,,,,,
ATSGTYVTEVPLKGSAEKH,nt,A,2,false,"Arg/N-end rule seed, prt6 vs. Wt",99,29168982,"MASCOT Score",50.9600000,,,,,0.00065340002765879,-2.0290875
ATSGTYVTEVPLKGSAE,nt,A,2,false,"N-terminal ChaFRADIC",92,26010716,"MASCOT Score",44.2100000,,,,,0.00047420000191778,
ATSGTYVTEVPLKGSAE,nt,A,2,false,"Arg/N-end rule seed, prt6 vs. Wt",99,29168982,"MASCOT Score",27.8800000,,,,,3.4390000109852E-6,0.6031424
ATSGTYVTEVPLKGSA,nt,A,2,false,"Arg/N-end rule seed, prt6 vs. Wt",99,29168982,"MASCOT Score",56.0200000,,,,,0.0085659995675087,5.9168060
ATSGTYVTEVPLKGS,nt,A,2,false,"Arg/N-end rule seed, prt6 vs. Wt",99,29168982,"MASCOT Score",44.8300000,,,,,0.0074760001152754,-1.3808231
ATSGTYVTEVPLKG,nt,A,2,false,"Arg/N-end rule seed, prt6 vs. Wt",99,29168982,"MASCOT Score",37.0700000,,,,,0.021560000255704,2.3956944
ATSGTYVTEVPL,nt,A,2,false,"Arg/N-end rule seed, prt6 vs. Wt",99,29168982,"MASCOT Score",25.4700000,,,,,0.200100004673,-0.3949701
ATSGTYVTEV,nt,A,2,false,"N-term acetylation drought responses",5,26184543,,,,,,,,
ATSGTYVTE,nt,A,2,false,"Arg/N-end rule seed, prt6 vs. Wt",99,29168982,"MASCOT Score",37.1400000,,-0.0715613,0.5346199,NO,0.0096819996833801,-2.6195398
ATSGTYVTEVPLKGSAEKHYKSWKSEN,nta,A,2,true,"HUNTER N-terminome: legumain, GluC and trypsin",119,31951383,"MaxQuant score",168.5600000,,,,,,
ATSGTYVTEVPLKGSAEKHYKSW,nta,A,2,true,"Arg/N-end rule pathway Roots",80,25728785,"MASCOT Score",46.1300000,,,,,0.00014319999900181,
ATSGTYVTEVPLKGSAEKHY,nta,A,2,false,"Stromal N-terminome",96,26371235,"MASCOT Score",46.0800000,,,,,,
ATSGTYVTEVPLKGSAEKHY,nta,A,2,false,"Arg/N-end rule seed, prt6 vs. Wt",99,29168982,"MASCOT Score",33.6200000,,-0.9388732,0.0320843,NO,0.00071839999873191,0.7234549
ATSGTYVTEVPLKGSAEKH,nta,A,2,false,"Stromal N-terminome",96,26371235,"MASCOT Score",43.7000000,,,,,,
ATSGTYVTEVPLKGSAEKH,nta,A,2,false,"Arg/N-end rule seed, prt6 vs. Wt",99,29168982,"MASCOT Score",50.9600000,,-0.4452507,0.0059722,NO,0.00065340002765879,-2.0290875
ATSGTYVTEVPLKGSAEK,nta,A,2,false,"Characterization plant N-terminal acetylation",6,22223895,"MASCOT Score",49.6500000,,,,,,
ATSGTYVTEVPLKGSAE,nta,A,2,false,"N-terminal ChaFRADIC",92,26010716,"MASCOT Score",44.2100000,,,,,0.00047420000191778,
ATSGTYVTEVPLKGSAE,nta,A,2,false,"Arg/N-end rule seed, prt6 vs. Wt",99,29168982,"MASCOT Score",27.8800000,,-0.4819991,0.3121942,NO,3.4390000109852E-6,0.6031424
ATSGTYVTEVPLKGSAE,nta,A,2,false,"HUNTER N-terminome: legumain, GluC and trypsin",119,31951383,"MaxQuant score",58.7520000,,,,,,
ATSGTYVTEVPLKGSA,nta,A,2,false,"Arg/N-end rule seed, prt6 vs. Wt",99,29168982,"MASCOT Score",56.0200000,,,,,0.0085659995675087,5.9168060
ATSGTYVTEVPLKGS,nta,A,2,false,"Arg/N-end rule seed, prt6 vs. Wt",99,29168982,"MASCOT Score",44.8300000,,,,,0.0074760001152754,-1.3808231
ATSGTYVTEVPLKG,nta,A,2,false,"Arg/N-end rule seed, prt6 vs. Wt",99,29168982,"MASCOT Score",37.0700000,,,,,0.021560000255704,2.3956944
ATSGTYVTEVPLK,nta,A,2,false,"Characterization plant N-terminal acetylation",6,22223895,"MASCOT Score",48.7200000,,,,,,
ATSGTYVTEVPL,nta,A,2,false,"Arg/N-end rule seed, prt6 vs. Wt",99,29168982,"MASCOT Score",25.4700000,,,,,0.200100004673,-0.3949701
ATSGTYVTEV,nta,A,2,false,"N-term acetylation drought responses",5,26184543,,,,,,,,
ATSGTYVTEVPLKGSAEK,ub,K,14,false,"upl3 mutant / wildtype",168,35926874,"MaxQuant score",142.3900000,1.0000000,-0.6393548,,,1.1906400150001E-15,-0.2146500
ATSGTYVTEVPLKGSAEK,ph,S,16,false,"Tissue atlas Arabidopsis - ProteomicsDB",114,32188942,"MaxQuant score",257.2200000,1.0000000,,,,0,
ATSGTYVTEVPLKGSAEKHYK,ac,K,19,false,"Quantitative Acetylproteomics",101,29440448,,,,,,,,
GSAEKHYK,ac,K,19,false,"Quantitative Acetylproteomics",101,29440448,,,,,,,,
SWDYTYDGKK,ac,K,65,true,"Quantitative Acetylproteomics",101,29440448,,,,,,,,
KEMFKEK,ac,K,70,true,"Quantitative Acetylproteomics",101,29440448,,,,,,,,
EIDDENKTLTKR,nt,E,74,true,"Metacaspase9 substrates - in vitro rMC9",51c,23964026,"MASCOT Score",71.0000000,,,,,,-0.4787915
EIDDENKTLTK,ac,K,80,true,"Quantitative Acetylproteomics",101,29440448,,,,,,,,
EIDDENKTLTK,ub,K,80,true,"upl3 mutant / wildtype",168,35926874,"MaxQuant score",124.4200000,1.0000000,1.5791801,0.1714790,NO,1.0839699825738E-5,0.6305300
EIDDENKTLTKR,ac,K,84,true,"Quantitative Acetylproteomics",101,29440448,,,,,,,,
SEDSCVCK,ox,C,112,true,"SPEAR - 10 mM H2O2 / mock",138a,34619326,,,,1.4395583,0.0059920,YES,,
ITMIWEKR,ac,K,122,false,"Quantitative Acetylproteomics",101,29440448,,,,,,,,
RNDDFPEPSGYMK,mox,M,134,true,"cat2 Methionine oxidation - 1h stress",62a,25693801,"MASCOT Score",104.0000000,,1.0685143,,NO,,
RNDDFPEPSGYMK,mox,M,134,true,"cat2 Methionine oxidation - 3h stress",62b,25693801,"MASCOT Score",85.0000000,,0.5940814,,NO,,
RNDDFPEPSGYMKFVK,ac,K,135,true,"Quantitative Acetylproteomics",101,29440448,,,,,,,,
RNDDFPEPSGYMKFVK,ub,K,135,true,"upl3 mutant / wildtype",168,35926874,"MaxQuant score",65.0380000,1.0000000,0.0676387,,,0.00020529699395411,-0.3008600
QMVVDIEGHVNKA,mox,M,140,true,"cat2 Methionine oxidation - 1h stress",62a,25693801,"MASCOT Score",65.0000000,,0.7990065,,NO,,
QMVVDIEGHVNK,mox,M,140,true,"cat2 Methionine oxidation - 1h stress",62a,25693801,"MASCOT Score",63.0000000,,1.4619563,,NO,,
QMVVDIEGHVNKA,ac,K,150,true,"Quantitative Acetylproteomics",101,29440448,,,,,,,,
QMVVDIEGHVNKA,ub,K,150,true,"upl3 mutant / wildtype",168,35926874,"MaxQuant score",112.5000000,1.0000000,0.6888517,,,6.0282600315986E-5,-0.8652700
