Peptide,PTM,ModifiedAA,ModifiedPosition,PeptideUniqueToGene,ExperimentDesc,ExpID,PubmedID,ScoreType,IdentScore,LocProb,Log2FChange,PQ-val,QuantSig,PEP,MassErrorPPM
SSDPPPSSSSSSSGNVVHHVKPAGER,ph,S,19,true,"Tissue atlas Arabidopsis - ProteomicsDB",114,32188942,"MaxQuant score",199.8100000,0.7786800,,,,0,
SSDPPPSSSSSSSGNVVHHVK,ph,S,19,true,"atm and atr DNA damage response",88,25561503,"MASCOT Score",43.0000000,0.9140000,,,,,0.6900000
SSDPPPSSSSSSSGNVVHHVKPAGERR,ph,S,20,true,"Tissue atlas Arabidopsis - ProteomicsDB",114,32188942,"MaxQuant score",212.7800000,0.8577340,,,,0,
SSDPPPSSSSSSSGNVVHHVKPAGER,ph,S,20,true,"atm and atr DNA damage response",88,25561503,"MASCOT Score",29.0000000,0.9430000,,,,,0.3200000
SSDPPPSSSSSSSGNVVHHVKPAGER,ph,S,22,true,"Tissue atlas Arabidopsis - ProteomicsDB",114,32188942,"MaxQuant score",154.8000000,0.9728640,,,,0,
RGSSGSGTVGSSGSGTGGSR,ph,S,38,true,"Large-scale phosphorylation discovery",44,23111157,XCorr,4.8030000,,,,,,
RGSSGSGTVGSSGSGTGGSR,ph,S,38,true,"SnRK2 protein kinase substrates",85,23776212,XCorr,3.2281721,0.9910000,,,,0.00029663598979823,
RGSSGSGTVGSSGSGTGGSR,ph,S,38,true,"atm and atr DNA damage response",88,25561503,"MASCOT Score",92.0000000,0.8910000,,,,,0.1000000
RGSSGSGTVGSSGSGTGGSR,ph,S,38,true,"Tissue atlas Arabidopsis - ProteomicsDB",114,32188942,"MaxQuant score",152.3700000,0.9998290,,,,6.9514097562952E-25,
RGSSGSGTVGSSGSGTGGSR,ph,S,39,true,"atm and atr DNA damage response",88,25561503,"MASCOT Score",63.0000000,0.9980000,,,,,-0.6400000
RGSSGSGTVGSSGSGTGGSR,ph,S,39,true,"Tissue atlas Arabidopsis - ProteomicsDB",114,32188942,"MaxQuant score",147.6000000,0.9896430,,,,7.6950800860267E-18,
RGSSGSGTVGSSGSGTGGSR,ph,S,41,true,"Tissue atlas Arabidopsis - ProteomicsDB",114,32188942,"MaxQuant score",123.6300000,0.9779250,,,,2.388769961188E-14,
RGSSGSGTVGSSGSGTGGSR,ph,S,46,true,"Tissue atlas Arabidopsis - ProteomicsDB",114,32188942,"MaxQuant score",77.5760000,0.7860570,,,,4.9318699893774E-5,
RGSSGSGTVGSSGSGTGGSR,ph,S,47,true,"atm and atr DNA damage response",88,25561503,"MASCOT Score",68.0000000,0.8130000,,,,,-0.2100000
RGSSGSGTVGSSGSGTGGSR,ph,S,47,true,"Tissue atlas Arabidopsis - ProteomicsDB",114,32188942,"MaxQuant score",125.8600000,0.8697420,,,,3.4250200738701E-17,
GSSGSGTVGSSGSGTGGSR,ph,S,47,true,"atm and atr DNA damage response",88,25561503,"MASCOT Score",103.0000000,0.9010000,,,,,-0.2000000
RGSSGSGTVGSSGSGTGGSR,ph,S,49,true,"Large-scale phosphorylation discovery",44,23111157,XCorr,3.2890000,,,,,,
RGSSGSGTVGSSGSGTGGSR,ph,S,49,true,"atm and atr DNA damage response",88,25561503,"MASCOT Score",51.0000000,0.9910000,,,,,0.0300000
GSSGSGTVGSSGSGTGGSR,ph,S,49,true,"atm and atr DNA damage response",88,25561503,"MASCOT Score",33.0000000,0.9630000,,,,,0.0100000
GSSGSGTVGSSGSGTGGSR,ph,S,49,true,"Tissue atlas Arabidopsis - ProteomicsDB",114,32188942,"MaxQuant score",254.7100000,0.8065520,,,,0,
GSSGSGTVGSSGSGTGGSR,ph,T,51,true,"atm and atr DNA damage response",88,25561503,"MASCOT Score",64.0000000,0.9860000,,,,,0.1500000
RGSSGSGTVGSSGSGTGGSR,ph,S,54,true,"Large-scale phosphorylation discovery",44,23111157,XCorr,2.7050000,,,,,,
GSSGSGTVGSSGSGTGGSR,ph,S,54,true,"Protein sumoylation and phosphorylation cross-talk",97,28419593,,,,,,,,
QQVACK,sno,C,106,true,"hot5-4 / wildtype, FAT-switch S-nitrosoproteome",169,37277371,,,,0.2344374,0.2976126,NO,,
QQVACK,so,C,106,true,"Arabidopsis S-sulfenylation chemoproteomics",108,31578252,"pFind PSM Score",0.1989930,,0.8196700,,,,-1.1338775
QQVACKSIPTRR,ub,K,107,true,"Protein ubiquitination during photomorphogenesis",3,28461270,,,,,,,,
LVHKDDIEDVR,ac,K,117,true,"Histone deacetylases - apicidin vs control",98a,29061669,"MaxQuant Score",74.6000000,1.0000000,0.0060000,0.9840111,NO,0.0010000000474975,
LVHKDDIEDVR,ub,K,117,true,"Arabidopsis ubiquitination COFRADIC",40,26744219,"MaxQuant Score",77.0620000,1.0000000,,,,0.00038439998752438,-0.7400000
EVQIMHHLSGHR,ph,S,134,true,"Tissue atlas Arabidopsis - ProteomicsDB",114,32188942,"MaxQuant score",82.5900000,1.0000000,,,,0.00044701399747282,
AAADLCR,sno,C,183,true,"hot5-4 / wildtype, FAT-switch S-nitrosoproteome",169,37277371,,,,,,,,
AAADLCR,so,C,183,true,"Arabidopsis S-sulfenylation chemoproteomics",108,31578252,"pFind PSM Score",0.0325046,,1.2064000,,,,0.4101435
EDGEASDKPLDNAVLSR,ph,S,343,true,"Tissue atlas Arabidopsis - ProteomicsDB",114,32188942,"MaxQuant score",58.2460000,0.9999830,,,,0.00098736095242202,
EDGEASDKPLDNAVLSR,ub,K,345,true,"Arabidopsis ubiquitination COFRADIC",40,26744219,"MaxQuant Score",95.1970000,1.0000000,,,,3.8520000652186E-15,-0.2460000
VIAENLSEEEIIGLK,ph,S,377,true,"Tissue atlas Arabidopsis - ProteomicsDB",114,32188942,"MaxQuant score",89.9360000,1.0000000,,,,0.00010420799662825,
