Peptide,PTM,ModifiedAA,ModifiedPosition,PeptideUniqueToGene,ExperimentDesc,ExpID,PubmedID,ScoreType,IdentScore,LocProb,Log2FChange,PQ-val,QuantSig,PEP,MassErrorPPM
YFTPNGTYDSNRR,ng,N,37,false,"Conserved N-glycosylation",74,22633491,"MaxQuant Score",143.1600000,0.9980000,,,,2.0350000439102E-14,0.8300000
VDFANLTK,ng,N,191,false,"Conserved N-glycosylation",74,22633491,"MaxQuant Score",63.9590000,1.0000000,,,,0.059000000357628,-0.4780000
TIEAATNKFSK,ub,K,352,true,"Ubiquitination Membrane Proteins",120,33585938,,,,,,,,
FGEVYKGK,ub,K,369,true,"Ubiquitination Membrane Proteins",120,33585938,,,,,,,,
GKFSNGTEVAVKR,ub,K,371,true,"Ubiquitination Membrane Proteins",120,33585938,,,,,,,,
GKFSNGTEVAVK,ub,K,371,true,"Ubiquitination Membrane Proteins",120,33585938,,,,,,,,
FSNGTEVAVKR,ub,K,381,false,"Ubiquitination Membrane Proteins",120,33585938,,,,,,,,
RELDPLSEGLESG,ph,S,654,true,"atm and atr DNA damage response",88,25561503,"MASCOT Score",38.0000000,1.0000000,,,,,-0.6600000
RELDPLSEGLESG,ph,S,659,true,"atm and atr DNA damage response",88,25561503,"MASCOT Score",38.0000000,1.0000000,,,,,-0.6600000
RELDPLSEGLESG,ph,S,659,true,"Tissue atlas Arabidopsis - ProteomicsDB",114,32188942,"MaxQuant score",205.8700000,1.0000000,,,,5.936799928494E-39,
