Peptide,PTM,ModifiedAA,ModifiedPosition,PeptideUniqueToGene,ExperimentDesc,ExpID,PubmedID,ScoreType,IdentScore,LocProb,Log2FChange,PQ-val,QuantSig,PEP,MassErrorPPM
TLLSSLSSLNASSYSTGFQTATAGQAPDR,ng,N,57,true,"ER-associatied N-glycan degradation chilling stres",133,27558752,,,,,,,,
VDVSSEVCR,sno,C,92,true,"hot5-4 / wildtype, FAT-switch S-nitrosoproteome",169,37277371,,,,-0.0335814,0.6214325,NO,,
CTPDLR,sno,C,196,false,"hot5-4 / wildtype, FAT-switch S-nitrosoproteome",169,37277371,,,,,,,,
YDNYAFYNESNVGTPQDSSPRPGK,ng,N,241,true,"Conserved N-glycosylation",74,22633491,"MaxQuant Score",209.7700000,0.9990000,,,,0,0.1860000
YDNYAFYNESNVGTPQDSSPRPGK,ng,N,241,true,"ER-associatied N-glycan degradation chilling stres",133,27558752,,,,,,,,
YKIIGGIAR,ub,K,427,false,"Ubiquitination Membrane Proteins",120,33585938,,,,,,,,
SKQEQAGPSIDSSTHCSVDEASITR,ph,S,628,true,"Phosphorylation Early Elicitor Signaling",23,17317660,,,,,,,,
SKQEQAGPSIDSSTHCSVDEASITR,ph,S,628,true,"Tissue atlas Arabidopsis - ProteomicsDB",114,32188942,"MaxQuant score",118.0000000,0.7870080,,,,7.4119698269447E-23,
SKQEQAGPSIDSSTHCSVDEASITR,ph,S,638,true,"Tissue atlas Arabidopsis - ProteomicsDB",114,32188942,"MaxQuant score",85.8580000,0.8784270,,,,9.5280500069655E-13,
