Peptide,PTM,ModifiedAA,ModifiedPosition,PeptideUniqueToGene,ExperimentDesc,ExpID,PubmedID,ScoreType,IdentScore,LocProb,Log2FChange,PQ-val,QuantSig,PEP,MassErrorPPM
QDPTYVYHTCQN,nt,Q,35,true,"HUNTER N-terminome: legumain, GluC and trypsin",119,31951383,"MaxQuant score",206.1000000,,,,,,
NASYSTGFQNATVGQAPDR,ng,N,71,true,"Conserved N-glycosylation",74,22633491,"MaxQuant Score",157.9000000,1.0000000,,,,3.9719804971287E-41,0.8820000
NASYSTGFQNATVGQAPDR,ng,N,80,true,"Conserved N-glycosylation",74,22633491,"MaxQuant Score",157.9000000,1.0000000,,,,3.9719804971287E-41,0.8820000
NASYSTGFQNATVGQAPDR,ng,N,80,true,"UDP-GlcNAc transporter glycopeptide analysis",135,30224661,,,,,,,7.9255966284634E-17,0.9000000
GDVSTEVCR,sno,C,105,true,"hot5-4 / wildtype, FAT-switch S-nitrosoproteome",169,37277371,,,,,,,,
CVSFAVNDTLTR,ng,N,114,true,"Conserved N-glycosylation",74,22633491,"MaxQuant Score",140.0600000,1.0000000,,,,3.1129999023428E-14,-0.0450000
EATLYYDECVLR,sno,C,133,true,"hot5-4 / wildtype, FAT-switch S-nitrosoproteome",169,37277371,,,,,,,,
NNFTALQSFYGLVQCTPDLTR,ng,N,196,true,"ER-associatied N-glycan degradation chilling stres",133,27558752,,,,,,,,
IINPSCTSR,sno,C,243,true,"hot5-4 / wildtype, FAT-switch S-nitrosoproteome",169,37277371,,,,,,,,
GTLSDGTEVAVKR,ac,K,376,true,"Quantitative Acetylproteomics",101,29440448,,,,,,,,
LLGFCLDGEER,ox,C,411,true,"SPEAR - 50 mM H2O2 / mock",138b,34619326,,,,-1.3424107,0.0222960,YES,,
YKIIGGVAR,ub,K,449,false,"Ubiquitination Membrane Proteins",120,33585938,,,,,,,,
YKIIGGVAR,ub,K,449,false,"upl3 mutant / wildtype",168,35926874,"MaxQuant score",80.2190000,1.0000000,1.4345615,,,0.0057939100079238,0.2024600
IFGLDQTEENTSR,ph,T,507,true,"Phosphorylation Early Elicitor Signaling",23,17317660,,,,,,,,
IFGLDQTEENTSR,ph,T,507,true,"atm and atr DNA damage response",88,25561503,"MASCOT Score",61.0000000,0.9580000,,,,,-0.0100000
IFGLDQTEENTSR,ph,T,507,true,"Tissue atlas Arabidopsis - ProteomicsDB",114,32188942,"MaxQuant score",276.5900000,0.9084040,,,,0,
IFGLDQTEENTSR,ph,S,508,true,"atm and atr DNA damage response",88,25561503,"MASCOT Score",51.0000000,0.9970000,,,,,0.2100000
IVGTYGYMSPEYAMHGQYSMK,ph,S,518,true,"Tissue atlas Arabidopsis - ProteomicsDB",114,32188942,"MaxQuant score",108.4900000,0.9953050,,,,4.3649499704805E-13,
QPGLFFQSR,nt,Q,631,true,"HUNTER N-terminome: legumain, GluC and trypsin",119,31951383,"MaxQuant score",67.9930000,,,,,,
QPGLFFQSR,ph,S,638,true,"atm and atr DNA damage response",88,25561503,"MASCOT Score",22.0000000,1.0000000,,,,,0.7100000
IGKDPLDTDTTSK,ub,K,642,true,"upl3 mutant / wildtype",168,35926874,"MaxQuant score",66.0040000,1.0000000,0.7337882,,,0.002268600044772,-1.0617000
IGKDPLDTDTTSK,ph,T,649,true,"Tissue atlas Arabidopsis - ProteomicsDB",114,32188942,"MaxQuant score",122.7500000,0.8889210,,,,0.00033806200372055,
IGKDPLDTDTTSK,ph,S,651,true,"Tissue atlas Arabidopsis - ProteomicsDB",114,32188942,"MaxQuant score",106.1900000,0.7997630,,,,0.00030318798962981,
SLLGSVDDASITDIHPR,ph,S,662,true,"Tissue atlas Arabidopsis - ProteomicsDB",114,32188942,"MaxQuant score",237.8600000,0.9996250,,,,0,
SLLGSVDDASITDIHPR,ph,S,662,true,"Touch-induced phosphorylation: 40s touch vs untouc",136,30291188,"MASCOT score",133.2300000,,0.1328539,0.5795138,NO,,1.8550619
