Peptide,PTM,ModifiedAA,ModifiedPosition,PeptideUniqueToGene,ExperimentDesc,ExpID,PubmedID,ScoreType,IdentScore,LocProb,Log2FChange,PQ-val,QuantSig,PEP,MassErrorPPM
ATTEQSGPVGGDNVD,nta,A,61,true,"HUNTER N-terminome: legumain, GluC and trypsin",119,31951383,"MaxQuant score",87.0010000,,,,,,
ATTEQSGPVGGDNVDSNVLPYCSINK,ph,T,63,true,"Tissue atlas Arabidopsis - ProteomicsDB",114,32188942,"MaxQuant score",110.5900000,0.9691500,,,,1.544960008751E-27,
QSGPVGGDNVDSNVLPYCSINKAE,nt,Q,65,true,"HUNTER N-terminome: legumain, GluC and trypsin",119,31951383,"MaxQuant score",,,,,,,
ATTEQSGPVGGDNVDSNVLPYCSINKAEK,acy,C,82,true,"Arabidopsis S-acylation atlas - Silique",163e,35681017,,,,,,,,
ATTEQSGPVGGDNVDSNVLPYCSINK,acy,C,82,true,"Arabidopsis S-acylation atlas - Silique",163e,35681017,,,,,,,,
ATTEQSGPVGGDNVDSNVLPYCSINK,ox,C,82,true,"SPEAR - 10 mM H2O2 / mock",138a,34619326,,,,0.4151708,0.0147145,YES,,
IDGSDIVSEGPRCSLR,acy,C,183,true,"Arabidopsis S-acylation atlas - Silique",163e,35681017,,,,,,,,
CTNCGTAMVYDSGSR,acy,C,300,true,"Arabidopsis S-acylation atlas - Silique",163e,35681017,,,,,,,,
LITLPEGSQA,ph,S,322,true,"atm and atr DNA damage response",88,25561503,"MASCOT Score",41.0000000,1.0000000,,,,,-0.2200000
