Peptide,PTM,ModifiedAA,ModifiedPosition,PeptideUniqueToGene,ExperimentDesc,ExpID,PubmedID,ScoreType,IdentScore,LocProb,Log2FChange,PQ-val,QuantSig,PEP,MassErrorPPM
EVLKTHDITFANHDLPEVGK,ub,K,112,false,"upl3 mutant / wildtype",168,35926874,"MaxQuant score",161.0800000,1.0000000,0.4027222,0.3764600,NO,6.6091801624924E-22,-1.0419000
THDITFANHDLPEVGK,ph,T,117,false,"Tissue atlas Arabidopsis - ProteomicsDB",114,32188942,"MaxQuant score",181.6100000,1.0000000,,,,8.0192502729417E-27,
FDFQGLVKQMK,ub,K,259,false,"upl3 mutant / wildtype",168,35926874,"MaxQuant score",54.7840000,1.0000000,-1.3291597,0.0316430,YES,0.0022558800410479,0.8505800
KLDLLFDR,ub,K,267,false,"upl3 mutant / wildtype",168,35926874,"MaxQuant score",103.5500000,1.0000000,-0.2688168,,,0.0033264700323343,-0.6487500
VKDDDEKAPLSMTHVK,ub,K,306,false,"Ubiquitination Membrane Proteins",120,33585938,,,,,,,,
VKDDDEKAPLSMTHVK,ub,K,306,false,"upl3 mutant / wildtype",168,35926874,"MaxQuant score",53.3950000,0.9980000,-0.4208199,0.7329400,NO,0.00065594498300925,-0.8920800
VKDDDEKAPLSMTHVK,ph,S,310,false,"Phospho cell culture sucrose/TOR",109,30833711,,,0.9869750,,,,,
APLSMTHVK,ph,S,310,false,"TOR Kinase and ABA Receptor",100,29290610,XCorr,3.7226951,0.9980000,,,,0.0016659999964759,
APLSMTHVK,ph,S,310,false,"Tissue atlas Arabidopsis - ProteomicsDB",114,32188942,"MaxQuant score",143.4000000,0.9397090,,,,3.0174698850693E-10,
DNIVEESHLPKLPYLQAVMK,ub,K,371,false,"upl3 mutant / wildtype",168,35926874,"MaxQuant score",99.2730000,1.0000000,-0.0218044,0.9779000,NO,1.7351400316556E-8,0.0157300
DPKNWDEPNEFKPER,ub,K,426,false,"upl3 mutant / wildtype",168,35926874,"MaxQuant score",71.5450000,1.0000000,0.0370307,,,0.00011555699893506,-1.6077000
NWDEPNEFKPER,ub,K,435,false,"upl3 mutant / wildtype",168,35926874,"MaxQuant score",52.5760000,1.0000000,,,,0.0027236100286245,0.2277000
FLENSLDFNGGDFK,ph,S,443,false,"Tissue atlas Arabidopsis - ProteomicsDB",114,32188942,"MaxQuant score",158.6500000,1.0000000,,,,1.7167299526388E-10,
RICAAINMAER,so,C,463,false,"Arabidopsis S-sulfenylation chemoproteomics",108,31578252,"pFind PSM Score",0.3003420,,1.1494300,,,,-1.7843226
LVLFNIASLLHSFDWKAPQGQK,ub,K,487,false,"upl3 mutant / wildtype",168,35926874,"MaxQuant score",116.3900000,1.0000000,1.6424705,,,1.8684600521809E-16,1.5739000
APQGQKFEVEEK,ub,K,493,false,"upl3 mutant / wildtype",168,35926874,"MaxQuant score",47.7120000,1.0000000,-0.3997302,,,0.0047901198267937,-0.2586100
LSDPKLYTA,ub,K,522,false,"upl3 mutant / wildtype",168,35926874,"MaxQuant score",64.7110000,1.0000000,-0.9686048,0.5911000,NO,0.022129099816084,-0.1865400
