Peptide,PTM,ModifiedAA,ModifiedPosition,PeptideUniqueToGene,ExperimentDesc,ExpID,PubmedID,ScoreType,IdentScore,LocProb,Log2FChange,PQ-val,QuantSig,PEP,MassErrorPPM
SKPLPETLSPCGSQR,ph,S,65,true,"atm and atr DNA damage response",88,25561503,"MASCOT Score",34.0000000,1.0000000,,,,,0.1600000
SKPLPETLSPCGSQR,ph,S,65,true,"Tissue atlas Arabidopsis - ProteomicsDB",114,32188942,"MaxQuant score",126.1400000,0.9975350,,,,2.0287800452934E-6,
SKPLPETLSPCGSQR,ph,S,69,true,"atm and atr DNA damage response",88,25561503,"MASCOT Score",36.0000000,1.0000000,,,,,-0.5800000
SKPLPETLSPCGSQR,ph,S,69,true,"Tissue atlas Arabidopsis - ProteomicsDB",114,32188942,"MaxQuant score",126.1400000,0.9999840,,,,1.2892900258521E-6,
RSSCDSNPPEFEFWR,ph,S,75,true,"Tissue atlas Arabidopsis - ProteomicsDB",114,32188942,"MaxQuant score",65.3950000,0.8903420,,,,0.0007409940008074,
SAGNNVTRPR,ph,S,224,true,"atm and atr DNA damage response",88,25561503,"MASCOT Score",23.0000000,1.0000000,,,,,-0.2600000
MSFGAPTTR,ph,S,235,true,"atm and atr DNA damage response",88,25561503,"MASCOT Score",41.0000000,1.0000000,,,,,0.1500000
MSFGAPTTR,ph,S,235,true,"Tissue atlas Arabidopsis - ProteomicsDB",114,32188942,"MaxQuant score",80.2450000,0.9999990,,,,0.0013613000046462,
KVSSAPCSR,ph,S,245,true,"atm and atr DNA damage response",88,25561503,"MASCOT Score",24.0000000,0.9950000,,,,,-2.1100000
KVSSAPCSR,ph,S,246,true,"atm and atr DNA damage response",88,25561503,"MASCOT Score",28.0000000,1.0000000,,,,,-1.9900000
KVSSAPCSR,ph,S,250,true,"atm and atr DNA damage response",88,25561503,"MASCOT Score",28.0000000,1.0000000,,,,,-1.9900000
KWPSSPSR,ph,S,266,true,"Tissue atlas Arabidopsis - ProteomicsDB",114,32188942,"MaxQuant score",118.9100000,0.8762390,,,,0.0022611799649894,
NSPVWQVR,ph,S,278,true,"atm and atr DNA damage response",88,25561503,"MASCOT Score",46.0000000,1.0000000,,,,,0.3600000
NSPVWQVR,ph,S,278,true,"Tissue atlas Arabidopsis - ProteomicsDB",114,32188942,"MaxQuant score",95.8220000,1.0000000,,,,0.00016356799460482,
