Peptide,PTM,ModifiedAA,ModifiedPosition,PeptideUniqueToGene,ExperimentDesc,ExpID,PubmedID,ScoreType,IdentScore,LocProb,Log2FChange,PQ-val,QuantSig,PEP,MassErrorPPM
NSWQDGVVGTTCPIPPGK,sno,C,101,true,"hot5-4 / wildtype, FAT-switch S-nitrosoproteome",169,37277371,,,,-0.1555499,0.3641392,NO,,
NFTYVIQVK,ng,N,108,true,"UDP-GlcNAc transporter glycopeptide analysis",135,30224661,,,,,,,1.8826271741545E-7,0.4000000
NLTASGPRPNPQGSYHYGLIKPGR,ng,N,324,true,"N-Glycopeptide Profiling in Arabidopsis Infloresce",132,27067053,"MOWSE score",51.7000000,,,,,9.6000000837648E-8,
NLTASGPRPNPQGSYHYGLIKPGR,ng,N,324,true,"ER-associatied N-glycan degradation chilling stres",133,27558752,,,,,,,,
NLTASGPRPNPQGSYHYGLIKPGR,ng,N,324,true,"N-linked Glycan Micro-heterogeneity Arabidopsis",134,29237727,,,,,,,,
NLTASGPRPNPQGSYHYGLIKPGR,ng,N,324,true,"UDP-GlcNAc transporter glycopeptide analysis",135,30224661,,,,,,,2.5325232949164E-17,0.5000000
NLTASGPRPNPQGSYHYGLIK,ng,N,324,true,"UDP-GlcNAc transporter glycopeptide analysis",135,30224661,,,,,,,7.4727679599818E-10,1.1000000
RNLTASGPR,ng,N,324,true,"Conserved N-glycosylation",74,22633491,"MaxQuant Score",156.3200000,1.0000000,,,,7.8069997471175E-6,0.0260000
NALMCGR,ox,C,530,true,"OxiTRAQ Arabidopsis - 5 mM H2O2 versus control",47,24376095,,,,0.0451332,0.6680014,NO,,
NALMCGR,sno,C,530,true,"hot5-4 / wildtype, FAT-switch S-nitrosoproteome",169,37277371,,,,,,,,
