Peptide,PTM,ModifiedAA,ModifiedPosition,PeptideUniqueToGene,ExperimentDesc,ExpID,PubmedID,ScoreType,IdentScore,LocProb,Log2FChange,PQ-val,QuantSig,PEP,MassErrorPPM
MDPMESSSEQDIVEESQKLVDSLDKLR,nta,M,1,true,"Arabidopsis translation initiation landscape - NTA",167a,35069635,,,,,,,,
MDPMESSSEQDIVEESQK,nta,M,1,true,"Characterization plant N-terminal acetylation",6,22223895,"MASCOT Score",87.6000000,,,,,,
MDPMESSSEQDIVEESQK,ph,S,6,true,"Lateral root-induction - NAA vs control",106,23328941,"MASCOT Score",27.0000000,,,,,,
MDPMESSSEQDIVEESQK,ph,S,6,true,"Tissue atlas Arabidopsis - ProteomicsDB",114,32188942,"MaxQuant score",101.0500000,0.8207600,,,,3.1815000056667E-7,
LVDSLDKLR,ph,S,22,true,"Tissue atlas Arabidopsis - ProteomicsDB",114,32188942,"MaxQuant score",98.1560000,1.0000000,,,,0.0024809499736875,
LRVSAASSSSNFK,ph,S,29,true,"Tissue atlas Arabidopsis - ProteomicsDB",114,32188942,"MaxQuant score",128.4500000,0.9998920,,,,0.00012261599476915,
LVCHTFDSK,so,C,63,true,"Arabidopsis S-sulfenylation chemoproteomics",108,31578252,"pFind PSM Score",0.0674988,,0.9615400,,,,-0.7379202
MMLEEDDEDFQVEDEEDSDDAIDEDDEDDETK,ph,S,361,true,"srk2dei ABA signaling phopshoproteomics",83,23572148,"MASCOT Score",24.0000000,,,,,,-0.0051000
MMLEEDDEDFQVEDEEDSDDAIDEDDEDDETK,ph,S,361,true,"SnRK2 protein kinase substrates",85,23776212,XCorr,4.9441404,1.0000000,,,,0.0027537799905986,
MMLEEDDEDFQVEDEEDSDDAIDEDDEDDETK,ph,S,361,true,"TOR Kinase and ABA Receptor",100,29290610,XCorr,4.7489352,1.0000000,,,,1.3859999853594E-5,
