Peptide,PTM,ModifiedAA,ModifiedPosition,PeptideUniqueToGene,ExperimentDesc,ExpID,PubmedID,ScoreType,IdentScore,LocProb,Log2FChange,PQ-val,QuantSig,PEP,MassErrorPPM
LTYASTLSHLR,ph,S,484,true,"Tissue atlas Arabidopsis - ProteomicsDB",114,32188942,"MaxQuant score",135.1400000,0.9965400,,,,6.15492012912E-7,
RLNSPIGR,ph,S,491,true,"atm and atr DNA damage response",88,25561503,"MASCOT Score",26.0000000,1.0000000,,,,,-0.4600000
RLNSPIGR,ph,S,491,true,"TOR Kinase and ABA Receptor",100,29290610,XCorr,3.6883235,1.0000000,,,,4.5330001739785E-5,
RLNSPIGR,ph,S,491,true,"Tissue atlas Arabidopsis - ProteomicsDB",114,32188942,"MaxQuant score",128.3800000,1.0000000,,,,0.0054520000703633,
DEEKKMGTLVK,me2,K,828,true,"Arabidopsis protein methylome",123,31809900,"MaxQuant Score",40.4960000,0.9648000,,,,0.011874600313604,-1.8928000
HGSYDKLDDDGLAPPGTR,ph,S,852,true,"SnRK2 protein kinase substrates",85,23776212,XCorr,2.7089968,0.8210000,,,,0.0091123096644878,
HGSYDKLDDDGLAPPGTR,ph,S,852,true,"atm and atr DNA damage response",88,25561503,"MASCOT Score",48.0000000,0.9440000,,,,,0.5200000
HGSYDKLDDDGLAPPGTR,ph,S,852,true,"Col-0 callus - FC Col-0 vs. Col-0 Xray",111a,31410901,,55.9400000,,0.6945257,0.0000000,NO,,0.1556513
HGSYDKLDDDGLAPPGTR,ph,S,852,true,"Col-0 X-ray callus - FC Col-0 vs. Col-0 Xray",111b,31410901,,55.9400000,,0.6945257,0.0000000,NO,,0.1556513
HGSYDKLDDDGLAPPGTR,ph,S,852,true,"atm callus - FC atm vs. atm Xray",111c,31410901,,55.9400000,,0.5700259,0.0000000,NO,,0.1556513
HGSYDKLDDDGLAPPGTR,ph,S,852,true,"atm-3 X-ray callus - FC atm vs. atm Xray",111d,31410901,,55.9400000,,0.5700259,0.0000000,NO,,0.1556513
HGSYDKLDDDGLAPPGTR,ph,S,852,true,"Tissue atlas Arabidopsis - ProteomicsDB",114,32188942,"MaxQuant score",290.6700000,1.0000000,,,,0,
EGDATPFTDVTVDNISK,ph,T,1006,true,"Tissue atlas Arabidopsis - ProteomicsDB",114,32188942,"MaxQuant score",208.3800000,1.0000000,,,,0,
