Peptide,PTM,ModifiedAA,ModifiedPosition,PeptideUniqueToGene,ExperimentDesc,ExpID,PubmedID,ScoreType,IdentScore,LocProb,Log2FChange,PQ-val,QuantSig,PEP,MassErrorPPM
MYSNNRVEVFHG,nta,M,1,true,"Arabidopsis translation initiation landscape - NTA",167a,35069635,,,,,,,,
HLVPSEPSLQSSPAREEGEVPESELDPDTR,ph,S,551,true,"Large-scale phosphorylation discovery",44,23111157,XCorr,4.9910000,,,,,,
HLVPSEPSLQSSPAREEGEVPESELDPDTR,ph,S,551,true,"TOR Kinase and ABA Receptor",100,29290610,XCorr,4.6927586,0.8241000,,,,0.00020369999401737,
HLVPSEPSLQSSPAREEGEVPESELDPDTR,ph,S,551,true,"Col-0 callus - FC Col-0 vs. Col-0 Xray",111a,31410901,,27.9000000,,1.0170239,0.0303197,YES,,1.0198132
HLVPSEPSLQSSPAREEGEVPESELDPDTR,ph,S,551,true,"Col-0 X-ray callus - FC Col-0 vs. Col-0 Xray",111b,31410901,,27.9000000,,1.0170239,0.0303197,YES,,1.0198132
HLVPSEPSLQSSPAREEGEVPESELDPDTR,ph,S,551,true,"atm callus - FC atm vs. atm Xray",111c,31410901,,27.9000000,,0.7815522,0.0274128,YES,,1.0198132
HLVPSEPSLQSSPAREEGEVPESELDPDTR,ph,S,551,true,"atm-3 X-ray callus - FC atm vs. atm Xray",111d,31410901,,27.9000000,,0.7815522,0.0274128,YES,,1.0198132
HLVPSEPSLQSSPAREEGEVPESELDPDTR,ph,S,551,true,"Tissue atlas Arabidopsis - ProteomicsDB",114,32188942,"MaxQuant score",167.9700000,0.9738730,,,,0,
HLVPSEPSLQSSPAREEGEVPESELDPDTRR,ph,S,554,true,"TOR Kinase and ABA Receptor",100,29290610,XCorr,3.9437556,0.8479000,,,,0.0095180002972484,
HLVPSEPSLQSSPAREEGEVPESELDPDTR,ph,S,554,true,"Large-scale phosphorylation discovery",44,23111157,XCorr,6.1460000,,,,,,
HLVPSEPSLQSSPAREEGEVPESELDPDTR,ph,S,554,true,"Tissue atlas Arabidopsis - ProteomicsDB",114,32188942,"MaxQuant score",179.1000000,0.8249860,,,,0,
HLVPSEPSLQSSPAR,ph,S,555,true,"srk2dei ABA signaling phopshoproteomics",83,23572148,"MASCOT Score",30.0000000,,,,,,0.0015000
HLVPSEPSLQSSPAR,ph,S,555,true,"atm and atr DNA damage response",88,25561503,"MASCOT Score",31.0000000,0.9350000,,,,,-0.5900000
HLVPSEPSLQSSPAR,ph,S,555,true,"Tissue atlas Arabidopsis - ProteomicsDB",114,32188942,"MaxQuant score",167.9200000,0.9657410,,,,0,
AVSKEYPLDSEMIHMEK,ph,S,631,true,"Tissue atlas Arabidopsis - ProteomicsDB",114,32188942,"MaxQuant score",167.7200000,1.0000000,,,,1.3112199841981E-22,
SVSATETSADVLHGIAIK,ph,S,720,true,"Tissue atlas Arabidopsis - ProteomicsDB",114,32188942,"MaxQuant score",323.0200000,0.9967870,,,,0,
HTGSITALR,ph,S,856,true,"atm and atr DNA damage response",88,25561503,"MASCOT Score",51.0000000,1.0000000,,,,,-0.1600000
HTGSITALR,ph,S,856,true,"TOR Kinase and ABA Receptor",100,29290610,XCorr,2.2527697,0.9050000,,,,0.006713000126183,
HTGSITALR,ph,S,856,true,"Tissue atlas Arabidopsis - ProteomicsDB",114,32188942,"MaxQuant score",117.2500000,0.9994090,,,,0.0003479220031295,
SFGGMSNKR,ac,K,947,true,"Quantitative Acetylproteomics",101,29440448,,,,,,,,
LKPDFQR,ac,K,950,true,"Quantitative Acetylproteomics",101,29440448,,,,,,,,
