Peptide,PTM,ModifiedAA,ModifiedPosition,PeptideUniqueToGene,ExperimentDesc,ExpID,PubmedID,ScoreType,IdentScore,LocProb,Log2FChange,PQ-val,QuantSig,PEP,MassErrorPPM
RLVDKHAETDDELMEK,ph,T,113,true,"Phospho cell culture sucrose/TOR",109,30833711,,,1.0000000,,,,,
LVDKHAETDDELMEK,ph,T,113,true,"SnRK2 protein kinase substrates",85,23776212,XCorr,2.1709552,1.0000000,,,,0.18400099873543,
LVDKHAETDDELMEK,ph,T,113,true,"atm and atr DNA damage response",88,25561503,"MASCOT Score",30.0000000,1.0000000,,,,,-1.3200000
LVDKHAETDDELMEK,ph,T,113,true,"Tissue atlas Arabidopsis - ProteomicsDB",114,32188942,"MaxQuant score",240.1800000,1.0000000,,,,0,
HAETDDELMEK,ph,T,113,true,"Mitochondrial phosphoproteome",32,19688752,"MASCOT Score",45.8100000,,,,,,-4.9118400
HAETDDELMEK,ph,T,113,true,"Tyrosine phosphorylation in Arabidopsis",59,18463617,"MASCOT Score",77.0000000,,,,,,-0.9308850
HAETDDELMEK,ph,T,113,true,"atm and atr DNA damage response",88,25561503,"MASCOT Score",46.0000000,1.0000000,,,,,0.4500000
HAETDDELMEK,ph,T,113,true,"TOR Kinase and ABA Receptor",100,29290610,XCorr,5.1899958,1.0000000,,,,1.2670000160142E-7,
HAETDDELMEK,ph,T,113,true,"Lateral root-induction - NAA vs control",106,23328941,"MASCOT Score",62.0000000,,,,,,
DDVKDEDFESDFEEAHSTDEELEDLYNSPEYVAEK,ph,S,137,false,"Brassinosteroid-Regulated Phosphorylation Dynamics",94,26187819,"MaxQuant Score",59.0170000,0.9950000,,,,0.0099999997764826,1.1900000
DDVKDEDFESDFEEAHSTDEELEDLYNSPEYVAEK,ph,S,144,false,"Brassinosteroid-Regulated Phosphorylation Dynamics",94,26187819,"MaxQuant Score",59.0170000,0.9900000,,,,0.0099999997764826,1.1900000
DDVKDEDFESDFEEAHSTDEELEDLYNSPEYVAEK,ph,T,145,false,"Brassinosteroid-Regulated Phosphorylation Dynamics",94,26187819,"MaxQuant Score",59.0170000,0.9900000,,,,0.0099999997764826,1.1900000
EGIQHGCLTDTK,so,C,188,false,"Arabidopsis S-sulfenylation chemoproteomics",108,31578252,"pFind PSM Score",0.0234412,,1.1699500,,,,0.5878770
TSYVKQR,ub,K,387,false,"Arabidopsis ubiquitination COFRADIC",40,26744219,"MaxQuant Score",97.0680000,1.0000000,,,,0.017000000923872,-0.0340000
AFMQK,mox,M,397,false,"cat2 Methionine oxidation - 3h stress",62b,25693801,"MASCOT Score",29.0000000,,-0.2026828,,NO,,
