Peptide,PTM,ModifiedAA,ModifiedPosition,PeptideUniqueToGene,ExperimentDesc,ExpID,PubmedID,ScoreType,IdentScore,LocProb,Log2FChange,PQ-val,QuantSig,PEP,MassErrorPPM
IPFRNSSGHR,ph,S,26,true,"Tissue atlas Arabidopsis - ProteomicsDB",114,32188942,"MaxQuant score",47.7740000,0.8601140,,,,0.010448800399899,
ERYLAQQQGEGADSV,ph,S,294,true,"STN8 phosphoproteome",38,21768351,"MASCOT Score",109.3300000,,,,,,-0.0596984
ERYLAQQQGEGADSV,ph,S,294,true,"Chloroplast kinase substrates",60,19376835,"MASCOT Score",103.9300000,,,,,,-0.8219350
ERYLAQQQGEGADSV,ph,S,294,true,"Col-0 callus - FC Col-0 vs. Col-0 Xray",111a,31410901,,104.4600000,,-1.4659569,0.0000000,NO,,1.3405715
ERYLAQQQGEGADSV,ph,S,294,true,"Col-0 X-ray callus - FC Col-0 vs. Col-0 Xray",111b,31410901,,104.4600000,,-1.4659569,0.0000000,NO,,1.3405715
ERYLAQQQGEGADSV,ph,S,294,true,"atm callus - FC atm vs. atm Xray",111c,31410901,,104.4600000,,0.2842511,0.0000000,NO,,1.3405715
ERYLAQQQGEGADSV,ph,S,294,true,"atm-3 X-ray callus - FC atm vs. atm Xray",111d,31410901,,104.4600000,,0.2842511,0.0000000,NO,,1.3405715
YLAQQQGEGADSV,ph,S,294,true,"Phosphorylation Early Elicitor Signaling",23,17317660,,,,,,,,
YLAQQQGEGADSV,ph,S,294,true,"STN8 phosphoproteome",38,21768351,"MASCOT Score",93.3600000,,,,,,-1.0973200
YLAQQQGEGADSV,ph,S,294,true,"Tyrosine phosphorylation in Arabidopsis",59,18463617,"MASCOT Score",59.0000000,,,,,,-0.5537918
YLAQQQGEGADSV,ph,S,294,true,"Chloroplast kinase substrates",60,19376835,"MASCOT Score",58.9200000,,,,,,-0.5581230
YLAQQQGEGADSV,ph,S,294,true,"Conserved plant phosphoproteome - Arabidopsis",61a,20466843,"MASCOT Score",66.0000000,1.0000000,,,,,
YLAQQQGEGADSV,ph,S,294,true,"srk2dei ABA signaling phopshoproteomics",83,23572148,"MASCOT Score",91.0000000,,,,,,0.0000000
YLAQQQGEGADSV,ph,S,294,true,"atm and atr DNA damage response",88,25561503,"MASCOT Score",90.0000000,1.0000000,,,,,-0.6700000
YLAQQQGEGADSV,ph,S,294,true,"Protein sumoylation and phosphorylation cross-talk",97,28419593,,,,,,,,
YLAQQQGEGADSV,ph,S,294,true,"TOR Kinase and ABA Receptor",100,29290610,XCorr,4.6455812,1.0000000,,,,1.4109999938228E-5,
YLAQQQGEGADSV,ph,S,294,true,"Lateral root-induction - NAA vs control",106,23328941,"MASCOT Score",79.0000000,,,,,,
YLAQQQGEGADSV,ph,S,294,true,"Col-0 callus - FC Col-0 vs. Col-0 Xray",111a,31410901,,80.6400000,,-0.7990685,0.0000000,NO,,0.4579761
YLAQQQGEGADSV,ph,S,294,true,"Col-0 X-ray callus - FC Col-0 vs. Col-0 Xray",111b,31410901,,80.6400000,,-0.7990685,0.0000000,NO,,0.4579761
YLAQQQGEGADSV,ph,S,294,true,"atm callus - FC atm vs. atm Xray",111c,31410901,,80.6400000,,-1.1821477,0.0000000,NO,,0.4579761
YLAQQQGEGADSV,ph,S,294,true,"atm-3 X-ray callus - FC atm vs. atm Xray",111d,31410901,,80.6400000,,-1.1821477,0.0000000,NO,,0.4579761
YLAQQQGEGADSV,ph,S,294,true,"Tissue atlas Arabidopsis - ProteomicsDB",114,32188942,"MaxQuant score",344.5500000,1.0000000,,,,0,
