Peptide,PTM,ModifiedAA,ModifiedPosition,PeptideUniqueToGene,ExperimentDesc,ExpID,PubmedID,ScoreType,IdentScore,LocProb,Log2FChange,PQ-val,QuantSig,PEP,MassErrorPPM
LNDLLYLNLSSNGFTGK,ng,N,180,true,"Conserved N-glycosylation",74,22633491,"MaxQuant Score",152.5800000,1.0000000,,,,1.6340000412927E-29,0.0580000
ANHLNLSYNKLTGSLPER,ng,N,416,true,"N-Glycopeptide Profiling in Arabidopsis Infloresce",132,27067053,"MOWSE score",29.4000000,,,,,0.0037000000011176,
ANHLNLSYNK,ng,N,416,true,"Conserved N-glycosylation",74,22633491,"MaxQuant Score",220.6300000,0.9780000,,,,0,-0.9040000
ANHLNLSYNK,ng,N,416,true,"N-linked Glycan Micro-heterogeneity Arabidopsis",134,29237727,,,,,,,,
ANHLNLSYNK,ng,N,416,true,"UDP-GlcNAc transporter glycopeptide analysis",135,30224661,,,,,,,8.8430646269164E-13,0.7000000
AQTIPSGSGGGMVVSAEDLVASR,ph,S,678,true,"atm and atr DNA damage response",88,25561503,"MASCOT Score",50.0000000,1.0000000,,,,,-0.5000000
AQTIPSGSGGGMVVSAEDLVASR,ph,S,678,true,"TOR Kinase and ABA Receptor",100,29290610,XCorr,4.7159653,1.0000000,,,,0.00015910000365693,
AQTIPSGSGGGMVVSAEDLVASR,ph,S,678,true,"Tissue atlas Arabidopsis - ProteomicsDB",114,32188942,"MaxQuant score",301.3400000,1.0000000,,,,0,
KGSSSEILSPDEK,ph,S,682,true,"Large-scale phosphorylation discovery",44,23111157,XCorr,4.1370000,,,,,,
KGSSSEILSPDEK,ph,S,682,true,"atm and atr DNA damage response",88,25561503,"MASCOT Score",30.0000000,1.0000000,,,,,-2.0800000
KGSSSEILSPDEK,ph,S,682,true,"Tissue atlas Arabidopsis - ProteomicsDB",114,32188942,"MaxQuant score",279.5700000,0.9987710,,,,0,
KGSSSEILSPDEK,ph,S,683,true,"Tissue atlas Arabidopsis - ProteomicsDB",114,32188942,"MaxQuant score",200.4600000,0.7976780,,,,2.0175098880734E-31,
KGSSSEILSPDEK,ph,S,684,true,"Tissue atlas Arabidopsis - ProteomicsDB",114,32188942,"MaxQuant score",182.3600000,0.9109690,,,,5.3239099155437E-22,
KGSSSEILSPDEK,ph,S,688,true,"STN8 phosphoproteome",38,21768351,"MASCOT Score",71.5700000,,,,,,-0.7329410
KGSSSEILSPDEK,ph,S,688,true,"Phosphoproteome ethylene-regulated time response",46,24043427,"MASCOT Score",39.4600000,,,,,,11.2031000
KGSSSEILSPDEK,ph,S,688,true,"Chloroplast kinase substrates",60,19376835,"MASCOT Score",69.5400000,,,,,,-0.7329410
KGSSSEILSPDEK,ph,S,688,true,"atm and atr DNA damage response",88,25561503,"MASCOT Score",60.0000000,0.8550000,,,,,-1.4300000
KGSSSEILSPDEK,ph,S,688,true,"Tissue atlas Arabidopsis - ProteomicsDB",114,32188942,"MaxQuant score",258.1200000,1.0000000,,,,0,
KGSSSEILSPDEK,ph,S,688,true,"Touch-induced phosphorylation: 40s touch vs untouc",136,30291188,"MASCOT score",79.5200000,,-0.0046003,0.9809092,NO,,4.5206417
GSSSEILSPDEK,ph,S,688,true,"atm and atr DNA damage response",88,25561503,"MASCOT Score",66.0000000,1.0000000,,,,,-1.3600000
GSSSEILSPDEK,ph,S,688,true,"TOR Kinase and ABA Receptor",100,29290610,XCorr,3.8782704,0.9979000,,,,4.5439999666996E-5,
LAVATGFSPSK,ph,S,700,true,"Arabidopsis root NAA phosphoproteome",18a,27643528,"MaxQuant Score",61.4090000,0.7840000,,,,6.8050001573283E-5,0.3120000
LAVATGFSPSK,ph,S,700,true,"Phosphorylation Early Elicitor Signaling",23,17317660,,,,,,,,
LAVATGFSPSK,ph,S,700,true,"srk2dei ABA signaling phopshoproteomics",83,23572148,"MASCOT Score",55.0000000,,,,,,-0.0005000
LAVATGFSPSK,ph,S,700,true,"atm and atr DNA damage response",88,25561503,"MASCOT Score",66.0000000,0.9980000,,,,,-2.4100000
LAVATGFSPSK,ph,S,700,true,"TOR Kinase and ABA Receptor",100,29290610,XCorr,3.8004589,0.9333000,,,,1.5910000001895E-6,
LAVATGFSPSK,ph,S,700,true,"Col-0 callus - FC Col-0 vs. Col-0 Xray",111a,31410901,,50.6700000,,-0.4538090,0.0000000,NO,,-1.0642007
LAVATGFSPSK,ph,S,700,true,"Col-0 X-ray callus - FC Col-0 vs. Col-0 Xray",111b,31410901,,50.6700000,,-0.4538090,0.0000000,NO,,-1.0642007
LAVATGFSPSK,ph,S,700,true,"atm callus - FC atm vs. atm Xray",111c,31410901,,50.6700000,,-1.6059457,0.0000000,NO,,-1.0642007
LAVATGFSPSK,ph,S,700,true,"atm-3 X-ray callus - FC atm vs. atm Xray",111d,31410901,,50.6700000,,-1.6059457,0.0000000,NO,,-1.0642007
LAVATGFSPSK,ph,S,700,true,"Tissue atlas Arabidopsis - ProteomicsDB",114,32188942,"MaxQuant score",204.8500000,0.9916280,,,,1.9344200598797E-24,
LAVATGFSPSK,ph,S,700,true,"Touch-induced phosphorylation: 40s touch vs untouc",136,30291188,"MASCOT score",67.4200000,,-0.1231301,0.7524260,NO,,6.5389797
TSNLSWSPGSGDSFPADQQLAR,ph,S,710,true,"Tissue atlas Arabidopsis - ProteomicsDB",114,32188942,"MaxQuant score",273.2700000,0.9999980,,,,0,
TSNLSWSPGSGDSFPADQQLAR,ph,S,710,true,"Touch-induced phosphorylation: 40s touch vs untouc",136,30291188,"MASCOT score",145.1500000,,0.2209923,0.4090578,NO,,0.2698116
LDVRSPDRLVGELHFLDDSIK,ph,S,730,true,"TOR Kinase and ABA Receptor",100,29290610,XCorr,2.5357049,1.0000000,,,,0.001674999948591,
SPDRLVGELHFLDDSIK,ph,S,730,true,"Tissue atlas Arabidopsis - ProteomicsDB",114,32188942,"MaxQuant score",134.2000000,1.0000000,,,,4.4657200160003E-10,
