Peptide,PTM,ModifiedAA,ModifiedPosition,PeptideUniqueToGene,ExperimentDesc,ExpID,PubmedID,ScoreType,IdentScore,LocProb,Log2FChange,PQ-val,QuantSig,PEP,MassErrorPPM
SQITDNVFSQTNPAFSSVLR,nt,S,52,true,"N-terminal ChaFRADIC",92,26010716,"MASCOT Score",83.3300000,,,,,6.3280001898203E-12,
SQITDNVFSQTNPAFSSVLR,nt,S,52,true,"HUNTER N-terminome: legumain, GluC and trypsin",119,31951383,"MaxQuant score",150.3900000,,,,,,
FNTSSTLKPTIIITPR,ng,N,80,true,"Conserved N-glycosylation",74,22633491,"MaxQuant Score",133.6400000,1.0000000,,,,2.822000113363E-16,-0.0790000
FNTSSTLKPTIIITPR,ng,N,80,true,"N-glycan occupancy Arabidopsis glycoproteins",87,23994444,"Ladder score",69.9000000,,,,,,
FNTSSTLKPTIIITPR,ng,N,80,true,"N-Glycopeptide Profiling in Arabidopsis Infloresce",132,27067053,"MOWSE score",48.6000000,,,,,9.9999999392253E-9,
FNTSSTLKPTIIITPR,ng,N,80,true,"N-linked Glycan Micro-heterogeneity Arabidopsis",134,29237727,,,,,,,,
FNTSSTLKPTIIITPR,ng,N,80,true,"UDP-GlcNAc transporter glycopeptide analysis",135,30224661,,,,,,,1.7707502935808E-18,0.6000000
SESHVSAAVTCSK,sno,C,105,true,"hot5-4 / wildtype, FAT-switch S-nitrosoproteome",169,37277371,,,,,,,,
LNATQVDPK,ng,N,359,true,"Conserved N-glycosylation",74,22633491,"MaxQuant Score",105.3500000,1.0000000,,,,0.00075990002369508,-0.0390000
LNATQVDPK,ng,N,359,true,"N-glycan occupancy Arabidopsis glycoproteins",87,23994444,"Ladder score",68.6000000,,,,,,
LNATQVDPK,ng,N,359,true,"N-linked Glycan Micro-heterogeneity Arabidopsis",134,29237727,,,,,,,,
LNATQVDPK,ng,N,359,true,"UDP-GlcNAc transporter glycopeptide analysis",135,30224661,,,,,,,7.8299735832843E-6,0.6000000
NLDTSSFGKR,ac,K,380,true,"Quantitative Acetylproteomics",101,29440448,,,,,,,,
KSDYVATAIPKK,ac,K,392,true,"Quantitative Acetylproteomics",101,29440448,,,,,,,,
SDYVATAIPKK,ac,K,392,true,"Quantitative Acetylproteomics",101,29440448,,,,,,,,
IKTAVDPGNFFR,ac,K,518,true,"Quantitative Acetylproteomics",101,29440448,,,,,,,,
