Peptide,PTM,ModifiedAA,ModifiedPosition,PeptideUniqueToGene,ExperimentDesc,ExpID,PubmedID,ScoreType,IdentScore,LocProb,Log2FChange,PQ-val,QuantSig,PEP,MassErrorPPM
YQRVSPDCLPLTNGGK,ph,S,8,true,"Tissue atlas Arabidopsis - ProteomicsDB",114,32188942,"MaxQuant score",231.2100000,1.0000000,,,,0,
VSPDCLPLTNGGK,ph,S,8,true,"atm and atr DNA damage response",88,25561503,"MASCOT Score",74.0000000,1.0000000,,,,,-0.5400000
KPYLRPSPSR,ph,S,26,true,"srk2dei ABA signaling phopshoproteomics",83,23572148,"MASCOT Score",25.0000000,,,,,,-0.0004000
KPYLRPSPSR,ph,S,28,true,"srk2dei ABA signaling phopshoproteomics",83,23572148,"MASCOT Score",33.0000000,,,,,,-0.0003000
STQQQQQQQDPSPSR,ph,S,88,true,"Tissue atlas Arabidopsis - ProteomicsDB",114,32188942,"MaxQuant score",158.5800000,0.9177310,,,,2.0992000591144E-14,
SANGSPSRNNINGR,ph,S,191,true,"Tissue atlas Arabidopsis - ProteomicsDB",114,32188942,"MaxQuant score",44.0050000,0.8121400,,,,0.0078066298738122,
RSPPSPDQIEK,ph,S,211,true,"atm and atr DNA damage response",88,25561503,"MASCOT Score",60.0000000,1.0000000,,,,,-0.4600000
RSPPSPDQIEK,ph,S,211,true,"TOR Kinase and ABA Receptor",100,29290610,XCorr,3.5922754,1.0000000,,,,0.0050240000709891,
SPPSPDQIEKR,ph,S,211,true,"Tissue atlas Arabidopsis - ProteomicsDB",114,32188942,"MaxQuant score",152.3200000,1.0000000,,,,6.1713501509075E-7,
SPPSPDQIEK,ph,S,211,true,"atm and atr DNA damage response",88,25561503,"MASCOT Score",46.0000000,1.0000000,,,,,1.2400000
RSPPSPDQIEK,ph,S,214,true,"atm and atr DNA damage response",88,25561503,"MASCOT Score",46.0000000,1.0000000,,,,,-0.6300000
RSPPSPDQIEK,ph,S,214,true,"TOR Kinase and ABA Receptor",100,29290610,XCorr,3.9688823,0.9993000,,,,0.00028989999555051,
SPPSPDQIEKR,ph,S,214,true,"Tissue atlas Arabidopsis - ProteomicsDB",114,32188942,"MaxQuant score",188.6800000,1.0000000,,,,2.8136300581072E-11,
SPPSPDQIEK,ph,S,214,true,"SnRK2 protein kinase substrates",85,23776212,XCorr,2.3200679,1.0000000,,,,0.011273199692369,
SPPSPDQIEK,ph,S,214,true,"atm and atr DNA damage response",88,25561503,"MASCOT Score",46.0000000,1.0000000,,,,,1.2400000
SPPSPDQIEK,ph,S,214,true,"Lateral root-induction - NAA vs control",106,23328941,"MASCOT Score",35.0000000,,,,,,
