Peptide,PTM,ModifiedAA,ModifiedPosition,PeptideUniqueToGene,ExperimentDesc,ExpID,PubmedID,ScoreType,IdentScore,LocProb,Log2FChange,PQ-val,QuantSig,PEP,MassErrorPPM
LQCTVSMAR,ph,S,31,true,"Tissue atlas Arabidopsis - ProteomicsDB",114,32188942,"MaxQuant score",95.6180000,0.9826140,,,,0.00046181998914108,
ARSAVDETSDSGAFQR,nt,A,33,true,"Arg/N-end rule pathway Roots",80,25728785,"MASCOT Score",64.4600000,,,,,7.294000283764E-7,
ARSAVDETSDSGAF,nta,A,33,true,"Arabidopsis translation initiation landscape - NTA",167a,35069635,,,,,,,,
SAVDETSDSGAFQR,nt,S,35,true,"Metacaspase9 substrates - in vitro rMC9",51c,23964026,"MASCOT Score",73.0000000,,2.6459456,,NO,,-0.1949717
SAVDETSDSGAFQR,ph,S,35,true,"Tyrosine phosphorylation in Arabidopsis",59,18463617,"MASCOT Score",46.0000000,,,,,,0.3228702
SAVDETSDSGAFQR,ph,S,35,true,"srk2dei ABA signaling phopshoproteomics",83,23572148,"MASCOT Score",70.0000000,,,,,,0.0005000
SAVDETSDSGAFQR,ph,S,35,true,"LAXIC - mannitol vs control",84b,23660473,XCorr,4.1000000,1.0000000,,,,7.72000021243E-6,
SAVDETSDSGAFQR,ph,S,35,true,"SnRK2 protein kinase substrates",85,23776212,XCorr,3.2231779,1.0000000,,,,1.7814700186136E-5,
SAVDETSDSGAFQR,ph,S,35,true,"atm and atr DNA damage response",88,25561503,"MASCOT Score",69.0000000,1.0000000,,,,,-1.2000000
SAVDETSDSGAFQR,ph,S,35,true,"Lateral root-induction - NAA vs control",106,23328941,"MASCOT Score",62.0000000,,,,,,
SAVDETSDSGAFQR,ph,S,35,true,"Phospho cell culture sucrose/TOR",109,30833711,,,0.9997340,,,,,
SAVDETSDSGAFQR,ph,S,35,true,"Tissue atlas Arabidopsis - ProteomicsDB",114,32188942,"MaxQuant score",150.2200000,0.9999920,,,,2.5890298616105E-7,
SAVDETSDSGAFQR,ph,T,40,true,"Tissue atlas Arabidopsis - ProteomicsDB",114,32188942,"MaxQuant score",305.6700000,0.9977650,,,,0,
SAVDETSDSGAFQR,ph,S,41,true,"srk2dei ABA signaling phopshoproteomics",83,23572148,"MASCOT Score",56.0000000,,,,,,-0.0014000
SAVDETSDSGAFQR,ph,S,41,true,"Lateral root-induction - NAA vs control",106,23328941,"MASCOT Score",37.0000000,,,,,,
SAVDETSDSGAFQR,ph,S,41,true,"Tissue atlas Arabidopsis - ProteomicsDB",114,32188942,"MaxQuant score",249.1900000,0.9183840,,,,0,
SAVDETSDSGAFQR,ph,S,43,true,"srk2dei ABA signaling phopshoproteomics",83,23572148,"MASCOT Score",50.0000000,,,,,,-0.0008000
SAVDETSDSGAFQR,ph,S,43,true,"Lateral root-induction - NAA vs control",106,23328941,"MASCOT Score",28.0000000,,,,,,
SAVDETSDSGAFQR,ph,S,43,true,"Tissue atlas Arabidopsis - ProteomicsDB",114,32188942,"MaxQuant score",278.6400000,0.9998190,,,,0,
ELYEIASPNYTGK,ph,S,151,true,"srk2dei ABA signaling phopshoproteomics",83,23572148,"MASCOT Score",59.0000000,,,,,,0.0002000
ELYEIASPNYTGK,ph,S,151,true,"SnRK2 protein kinase substrates",85,23776212,XCorr,2.6871798,1.0000000,,,,4.9059998730172E-8,
ELYEIASPNYTGK,ph,S,151,true,"Tissue atlas Arabidopsis - ProteomicsDB",114,32188942,"MaxQuant score",220.4800000,0.9999850,,,,0,
ELYEIASPNYTGK,ph,Y,154,true,"TOR Kinase and ABA Receptor",100,29290610,XCorr,4.1654353,0.9943000,,,,6.0090001170465E-6,
ELYEIASPNYTGK,ph,Y,154,true,"Lateral root-induction - NAA vs control",106,23328941,"MASCOT Score",28.0000000,,,,,,
ELYEIASPNYTGKYTVPVLWDKK,sumo,K,157,true,"SUMO Ligase SIZ1 heat stress",4,29588388,,,,,,,,
STVNMNHIKQHYY,nt,S,313,true,"Arabidopsis translation initiation landscape - NT",167b,35069635,,,,,,,,
