Peptide,PTM,ModifiedAA,ModifiedPosition,PeptideUniqueToGene,ExperimentDesc,ExpID,PubmedID,ScoreType,IdentScore,LocProb,Log2FChange,PQ-val,QuantSig,PEP,MassErrorPPM
VPITYLQSAVAKGAVCLD,nt,V,24,true,"HUNTER N-terminome: legumain, GluC and trypsin",119,31951383,"MaxQuant score",147.5600000,,,,,,
GAVCLDGSAPAYHFDK,acy,C,39,false,"Arabidopsis S-acylation atlas - Meristem",163a,35681017,,,,,,,,
GAVCLDGSAPAYHFDK,sno,C,39,false,"hot5-4 / wildtype, FAT-switch S-nitrosoproteome",169,37277371,,,,,,,,
YCDGSSFTGNVEAVNPANK,sno,C,121,true,"hot5-4 / wildtype, FAT-switch S-nitrosoproteome",169,37277371,,,,-0.2692111,0.1012197,NO,,
DGSSFTGNVE,nt,D,122,true,"Arg/N-end rule seed, prt6 vs. Wt",99,29168982,"MASCOT Score",54.0100000,,-0.9357622,0.0020735,NO,9.2080001195427E-5,-1.2853093
NAQNAILSGCSAGALAAILHCDTFR,ox,C,170,true,"OxiTRAQ SA and flg22 responses - SA vs mock",91a,25720653,"MASCOT Score",72.2700000,,1.1440464,0.0380000,YES,,
NAQNAILSGCSAGALAAILHCDTFR,ox,C,170,true,"OxiTRAQ SA and flg22 responses - flg22 vs mock",91b,25720653,"MASCOT Score",72.2700000,,1.1243281,0.0090000,YES,,
NAQNAILSGCSAGALAAILHCDTFR,ox,C,181,true,"OxiTRAQ SA and flg22 responses - SA vs mock",91a,25720653,"MASCOT Score",72.2700000,,1.1440464,0.0380000,YES,,
NAQNAILSGCSAGALAAILHCDTFR,ox,C,181,true,"OxiTRAQ SA and flg22 responses - flg22 vs mock",91b,25720653,"MASCOT Score",72.2700000,,1.1243281,0.0090000,YES,,
CVSDAGYFIHGK,acy,C,196,false,"Arabidopsis S-acylation atlas - Meristem",163a,35681017,,,,,,,,
CVSDAGYFIHGK,acy,C,196,false,"Arabidopsis S-acylation atlas - Leaf",163c,35681017,,,,,,,,
CVSDAGYFIHGK,sno,C,196,false,"hot5-4 / wildtype, FAT-switch S-nitrosoproteome",169,37277371,,,,,,,,
SLPVSCTSK,ox,C,236,true,"OxiTRAQ Arabidopsis - 5 mM H2O2 versus control",47,24376095,,,,-0.1899758,0.0784016,NO,,
SLPVSCTSK,sno,C,236,true,"hot5-4 / wildtype, FAT-switch S-nitrosoproteome",169,37277371,,,,-0.2369782,0.0831026,NO,,
MKPELCFFPQYVVPSMR,ox,C,245,true,"OxiTRAQ SA and flg22 responses - SA vs mock",91a,25720653,"MASCOT Score",27.2900000,,0.9486008,0.0780000,NO,,
MKPELCFFPQYVVPSMR,ox,C,245,true,"OxiTRAQ SA and flg22 responses - flg22 vs mock",91b,25720653,"MASCOT Score",27.2900000,,0.8073549,0.0340000,YES,,
CSAAQLK,sno,C,296,true,"hot5-4 / wildtype, FAT-switch S-nitrosoproteome",169,37277371,,,,-0.7334013,0.0101633,YES,,
