Peptide,PTM,ModifiedAA,ModifiedPosition,PeptideUniqueToGene,ExperimentDesc,ExpID,PubmedID,ScoreType,IdentScore,LocProb,Log2FChange,PQ-val,QuantSig,PEP,MassErrorPPM
ADRLTRIAIVSSD,nt,A,2,true,"Arg/N-end rule seed, prt6 vs. Wt",99,29168982,"MASCOT Score",38.2100000,,,,,0.0012379999971017,-1.9884266
ADRLTRIAIVSS,nt,A,2,true,"Arg/N-end rule seed, prt6 vs. Wt",99,29168982,"MASCOT Score",34.9000000,,,,,0.013380000367761,-1.8157618
ADRLTRIAIVSSDRCKPKKCRQE,nta,A,2,true,"Arabidopsis translation initiation landscape - NTA",167a,35069635,,,,,,,,
ADRLTRIAIVSSD,nta,A,2,true,"Arg/N-end rule seed, prt6 vs. Wt",99,29168982,"MASCOT Score",38.2100000,,,,,0.0012379999971017,-1.9884266
ADRLTRIAIVSS,nta,A,2,true,"Arg/N-end rule seed, prt6 vs. Wt",99,29168982,"MASCOT Score",34.9000000,,,,,0.013380000367761,-1.8157618
IAIVSSDR,ph,S,12,true,"Tissue atlas Arabidopsis - ProteomicsDB",114,32188942,"MaxQuant score",96.0150000,0.8815440,,,,0.0057870498858392,
SCPVVK,sno,C,29,false,"hot5-4 / wildtype, FAT-switch S-nitrosoproteome",169,37277371,,,,0.6646451,0.0070158,YES,,
LCIEVTVGSK,so,C,38,true,"S-sulfenylation site detection using YAP1C",110,32714340,,,,,,,,
CPFEAIQIINLPR,ox,C,65,true,"SPEAR - 10 mM H2O2 / mock",138a,34619326,,,,3.2510077,0.0080353,YES,,
DLEKDTTHR,ub,K,81,true,"Arabidopsis ubiquitination COFRADIC",40,26744219,"MaxQuant Score",85.3550000,1.0000000,,,,0.0049999998882413,-0.1640000
AVKGNVGEVLDQKDER,nt,A,179,true,"Metacaspase9 substrates - in vitro rMC9",51c,23964026,"MASCOT Score",84.0000000,,4.9929257,,NO,,-2.0345455
GNVGEVLDQKDER,ac,K,191,true,"Histone deacetylases - apicidin vs control",98a,29061669,"MaxQuant Score",87.5000000,1.0000000,-0.2340000,0.1896706,NO,3.7000000929766E-7,
GNVGEVLDQKDER,ac,K,191,true,"Histone deacetylases substrates - hda14 vs WT",98e,29061669,"MaxQuant Score",113.4000000,1.0000000,-0.0580000,0.9183326,NO,9.9999998245167E-14,
GNVGEVLDQKDER,ac,K,191,true,"Quantitative Acetylproteomics",101,29440448,,,,,,,,
KAELCADLELNQVIDR,so,C,201,true,"Arabidopsis S-sulfenylation chemoproteomics",108,31578252,"pFind PSM Score",0.0401903,,,,,,0.4132425
DVENLSGGELQR,nt,D,213,true,"Metacaspase9 substrates - in vitro rMC9",51c,23964026,"MASCOT Score",63.0000000,,,,,,-0.1443336
FRDESLTFK,ph,S,328,true,"atm and atr DNA damage response",88,25561503,"MASCOT Score",42.0000000,1.0000000,,,,,0.1400000
FRDESLTFK,ph,S,328,true,"Tissue atlas Arabidopsis - ProteomicsDB",114,32188942,"MaxQuant score",124.3900000,0.9973110,,,,0.00040589401032776,
FRDESLTFK,ph,T,330,true,"atm and atr DNA damage response",88,25561503,"MASCOT Score",34.0000000,1.0000000,,,,,-0.4700000
VAETPQESAEEIQSYAR,ph,T,336,true,"Tissue atlas Arabidopsis - ProteomicsDB",114,32188942,"MaxQuant score",70.9420000,0.9998310,,,,0.0013910999987274,
VAETPQESAEEIQSYAR,ph,S,340,true,"Tissue atlas Arabidopsis - ProteomicsDB",114,32188942,"MaxQuant score",131.4500000,0.9999010,,,,7.0305700150541E-10,
YKYPTMTKTQGNFR,ac,K,357,true,"Quantitative Acetylproteomics",101,29440448,,,,,,,,
ISPKFQNSVR,ub,K,425,true,"upl3 mutant / wildtype",168,35926874,"MaxQuant score",63.6940000,1.0000000,0.0772430,,,0.002499759895727,-1.5987000
SYMHPQFMSDVMKPLQIE,nt,S,441,true,"Arabidopsis translation initiation landscape - NT",167b,35069635,,,,,,,,
INKLESTKDR,ph,S,588,true,"Tissue atlas Arabidopsis - ProteomicsDB",114,32188942,"MaxQuant score",70.8890000,0.7777480,,,,0.0018250800203532,
