Peptide,PTM,ModifiedAA,ModifiedPosition,PeptideUniqueToGene,ExperimentDesc,ExpID,PubmedID,ScoreType,IdentScore,LocProb,Log2FChange,PQ-val,QuantSig,PEP,MassErrorPPM
HSASLQDFSSYHGFDPEESILPR,ph,S,58,true,"Tissue atlas Arabidopsis - ProteomicsDB",114,32188942,"MaxQuant score",130.2100000,0.9903460,,,,1.1535099653933E-23,
HSASLQDFSSYHGFDPEESILPR,ph,S,60,true,"TOR Kinase and ABA Receptor",100,29290610,XCorr,3.2718897,0.8716000,,,,8.6949999968056E-5,
HSASLQDFSSYHGFDPEESILPR,ph,S,60,true,"Tissue atlas Arabidopsis - ProteomicsDB",114,32188942,"MaxQuant score",306.5100000,0.9999980,,,,0,
EAISWGQNGSSFSK,ph,S,92,true,"Tyrosine phosphorylation in Arabidopsis",59,18463617,"MASCOT Score",29.0000000,,,,,,-1.0782327
THNETNLNLR,ng,N,330,true,"Conserved N-glycosylation",74,22633491,"MaxQuant Score",156.6500000,1.0000000,,,,5.9429999810234E-10,1.2000000
THNETNLNLR,ng,N,330,true,"UDP-GlcNAc transporter glycopeptide analysis",135,30224661,,,,,,,1.7848422430689E-5,1.0000000
LVGAPNWGECSALAK,acy,C,430,true,"Arabidopsis S-acylation atlas - Meristem",163a,35681017,,,,,,,,
NAVNSSEWSNAK,ng,N,439,true,"Conserved N-glycosylation",74,22633491,"MaxQuant Score",141.4000000,0.9980000,,,,2.6489999972214E-14,-0.8890000
HNSTSASSVLNIPSPFR,ph,S,625,true,"Tissue atlas Arabidopsis - ProteomicsDB",114,32188942,"MaxQuant score",260.5300000,0.9979950,,,,0,
HNSTSASSVLNIPSPFR,ph,S,636,true,"Tissue atlas Arabidopsis - ProteomicsDB",114,32188942,"MaxQuant score",188.8600000,1.0000000,,,,8.5582703163594E-31,
TPLSPTVR,ph,S,655,true,"Tissue atlas Arabidopsis - ProteomicsDB",114,32188942,"MaxQuant score",183.0000000,1.0000000,,,,9.7748497864814E-6,
TPLSPTVR,ph,T,657,true,"TOR Kinase and ABA Receptor",100,29290610,XCorr,2.8224475,0.9246000,,,,0.048280000686646,
TPLSPTVRGSPR,ph,S,661,true,"Tissue atlas Arabidopsis - ProteomicsDB",114,32188942,"MaxQuant score",91.0700000,0.9911850,,,,0.0002776829933282,
RSQSREDLSSSLADSHMLK,ph,S,722,true,"Tissue atlas Arabidopsis - ProteomicsDB",114,32188942,"MaxQuant score",192.1200000,0.9999970,,,,0,
RSQSREDLSSSLADSHMLK,ph,S,724,true,"Tissue atlas Arabidopsis - ProteomicsDB",114,32188942,"MaxQuant score",165.4800000,0.9999660,,,,1.3914499781584E-23,
SQSREDLSSSLADSHMLK,ph,S,724,true,"atm and atr DNA damage response",88,25561503,"MASCOT Score",30.0000000,0.9950000,,,,,0.2600000
SQSREDLSSSLADSHMLK,ph,S,724,true,"TOR Kinase and ABA Receptor",100,29290610,XCorr,4.3870726,0.9077000,,,,3.1130000479607E-6,
EDLSSSLADSHMLK,ph,S,729,true,"Tissue atlas Arabidopsis - ProteomicsDB",114,32188942,"MaxQuant score",67.0950000,0.9835940,,,,0.0018815400544554,
EDLSSSLADSHMLK,ph,S,731,true,"Tissue atlas Arabidopsis - ProteomicsDB",114,32188942,"MaxQuant score",125.9700000,0.8019960,,,,3.7354198866524E-5,
