Peptide,PTM,ModifiedAA,ModifiedPosition,PeptideUniqueToGene,ExperimentDesc,ExpID,PubmedID,ScoreType,IdentScore,LocProb,Log2FChange,PQ-val,QuantSig,PEP,MassErrorPPM
MEEDYQQPRF,nta,M,1,true,"N-term acetylation drought responses",5,26184543,,,,,,,,
MEEDYQQPRF,nta,M,1,true,"Arabidopsis translation initiation landscape - NTA",167a,35069635,,,,,,,,
MEEDYQQPR,nta,M,1,true,"Characterization plant N-terminal acetylation",6,22223895,"MASCOT Score",66.7400000,,,,,,
MEEDYQQPR,nta,M,1,true,"Arg/N-end rule pathway Roots",80,25728785,"MASCOT Score",44.4600000,,,,,0.0011640000157058,
QSSMAPEK,ph,S,17,true,"atm and atr DNA damage response",88,25561503,"MASCOT Score",34.0000000,0.9970000,,,,,-3.5200000
IPEPSVHSEEEVFEDGEEIDGGVR,ph,S,27,true,"Large-scale phosphorylation discovery",44,23111157,XCorr,6.4640000,,,,,,
IPEPSVHSEEEVFEDGEEIDGGVR,ph,S,27,true,"srk2dei ABA signaling phopshoproteomics",83,23572148,"MASCOT Score",79.0000000,,,,,,0.0004000
IPEPSVHSEEEVFEDGEEIDGGVR,ph,S,27,true,"LAXIC - mannitol vs control",84b,23660473,XCorr,5.3800000,0.9280000,,,,5.9700000498708E-9,
IPEPSVHSEEEVFEDGEEIDGGVR,ph,S,27,true,"SnRK2 protein kinase substrates",85,23776212,XCorr,5.1307364,0.9260000,,,,3.23944995273E-8,
IPEPSVHSEEEVFEDGEEIDGGVR,ph,S,27,true,"Brassinosteroid-Regulated Phosphorylation Dynamics",94,26187819,"MaxQuant Score",159.7500000,1.0000000,,,,1.6330000435465E-31,-0.3310000
IPEPSVHSEEEVFEDGEEIDGGVR,ph,S,27,true,"TOR Kinase and ABA Receptor",100,29290610,XCorr,5.1569591,1.0000000,,,,0.00012559999595396,
IPEPSVHSEEEVFEDGEEIDGGVR,ph,S,27,true,"Lateral root-induction - NAA vs control",106,23328941,"MASCOT Score",50.0000000,,,,,,
IPEPSVHSEEEVFEDGEEIDGGVR,ph,S,27,true,"Phospho cell culture sucrose/TOR",109,30833711,,,0.8821540,,,,,
IPEPSVHSEEEVFEDGEEIDGGVR,ph,S,27,true,"Tissue atlas Arabidopsis - ProteomicsDB",114,32188942,"MaxQuant score",181.6400000,1.0000000,,,,0,
QSSMAPEKIPEPSVHSEEEVFEDGEEIDGGVR,ph,S,30,true,"SnRK2 protein kinase substrates",85,23776212,XCorr,3.0474496,0.8520000,,,,1.4695800018671E-5,
IPEPSVHSEEEVFEDGEEIDGGVR,ph,S,30,true,"Large-scale phosphorylation discovery",44,23111157,XCorr,4.4570000,,,,,,
IPEPSVHSEEEVFEDGEEIDGGVR,ph,S,30,true,"srk2dei ABA signaling phopshoproteomics",83,23572148,"MASCOT Score",92.0000000,,,,,,0.0006000
IPEPSVHSEEEVFEDGEEIDGGVR,ph,S,30,true,"LAXIC - mannitol vs control",84b,23660473,XCorr,4.6100000,1.0000000,,,,1.4599999811557E-12,
IPEPSVHSEEEVFEDGEEIDGGVR,ph,S,30,true,"Brassinosteroid-Regulated Phosphorylation Dynamics",94,26187819,"MaxQuant Score",159.7500000,1.0000000,,,,1.6330000435465E-31,-0.3310000
IPEPSVHSEEEVFEDGEEIDGGVR,ph,S,30,true,"TOR Kinase and ABA Receptor",100,29290610,XCorr,5.1569591,1.0000000,,,,0.00012559999595396,
IPEPSVHSEEEVFEDGEEIDGGVR,ph,S,30,true,"Lateral root-induction - NAA vs control",106,23328941,"MASCOT Score",76.0000000,,,,,,
IPEPSVHSEEEVFEDGEEIDGGVR,ph,S,30,true,"Phospho cell culture sucrose/TOR",109,30833711,,,0.9892460,,,,,
IPEPSVHSEEEVFEDGEEIDGGVR,ph,S,30,true,"Col-0 callus - FC Col-0 vs. Col-0 Xray",111a,31410901,,74.2200000,,0.4661007,0.0000000,NO,,1.2535698
IPEPSVHSEEEVFEDGEEIDGGVR,ph,S,30,true,"Col-0 X-ray callus - FC Col-0 vs. Col-0 Xray",111b,31410901,,74.2200000,,0.4661007,0.0000000,NO,,1.2535698
IPEPSVHSEEEVFEDGEEIDGGVR,ph,S,30,true,"atm callus - FC atm vs. atm Xray",111c,31410901,,74.2200000,,1.4316798,0.0000000,NO,,1.2535698
IPEPSVHSEEEVFEDGEEIDGGVR,ph,S,30,true,"atm-3 X-ray callus - FC atm vs. atm Xray",111d,31410901,,74.2200000,,1.4316798,0.0000000,NO,,1.2535698
IPEPSVHSEEEVFEDGEEIDGGVR,ph,S,30,true,"Tissue atlas Arabidopsis - ProteomicsDB",114,32188942,"MaxQuant score",280.3500000,1.0000000,,,,0,
TALHVAACQGLK,so,C,85,true,"Arabidopsis S-sulfenylation chemoproteomics",108,31578252,"pFind PSM Score",0.0014613,,0.8302900,,,,0.0245431
KLDDEVLSDDDQVRK,ph,S,192,true,"Tyrosine phosphorylation in Arabidopsis",59,18463617,"MASCOT Score",34.0000000,,,,,,-1.0249004
KLDDEVLSDDDQVR,ph,S,192,true,"Large-scale phosphorylation discovery",44,23111157,XCorr,3.0990000,,,,,,
KLDDEVLSDDDQVR,ph,S,192,true,"Tyrosine phosphorylation in Arabidopsis",59,18463617,"MASCOT Score",37.0000000,,,,,,0.0579460
KLDDEVLSDDDQVR,ph,S,192,true,"Conserved plant phosphoproteome - Arabidopsis",61a,20466843,"MASCOT Score",37.0000000,1.0000000,,,,,
KLDDEVLSDDDQVR,ph,S,192,true,"atm and atr DNA damage response",88,25561503,"MASCOT Score",44.0000000,1.0000000,,,,,1.0200000
KLDDEVLSDDDQVR,ph,S,192,true,"Tissue atlas Arabidopsis - ProteomicsDB",114,32188942,"MaxQuant score",167.9900000,1.0000000,,,,1.0481500150306E-15,
HNWDLSSHDGSSSGSHL,ph,S,453,true,"Tissue atlas Arabidopsis - ProteomicsDB",114,32188942,"MaxQuant score",133.2100000,0.9078790,,,,1.5352200066765E-10,
