Peptide,PTM,ModifiedAA,ModifiedPosition,PeptideUniqueToGene,ExperimentDesc,ExpID,PubmedID,ScoreType,IdentScore,LocProb,Log2FChange,PQ-val,QuantSig,PEP,MassErrorPPM
TSGTRTPTWK,ph,T,2,true,"Tissue atlas Arabidopsis - ProteomicsDB",114,32188942,"MaxQuant score",87.9890000,0.9228090,,,,0.0072471001185477,
TSGTRTPTWK,ph,T,5,true,"Tissue atlas Arabidopsis - ProteomicsDB",114,32188942,"MaxQuant score",73.9300000,0.9419170,,,,0.0024999200832099,
TSGTRTPTWK,ph,T,7,true,"Tissue atlas Arabidopsis - ProteomicsDB",114,32188942,"MaxQuant score",98.8110000,0.9458560,,,,0.0024137799628079,
MDLMNGSTSASPCSSYQHSPR,ph,S,98,true,"Tissue atlas Arabidopsis - ProteomicsDB",114,32188942,"MaxQuant score",154.1000000,0.9957900,,,,9.2426803219302E-28,
LPFFHGNSISAPVTPPLAR,ph,S,147,true,"Large-scale phosphorylation discovery",44,23111157,XCorr,3.3360000,,,,,,
NLSSNSPSKLPFFHGNSISAPVTPPLAR,ph,S,149,true,"Tissue atlas Arabidopsis - ProteomicsDB",114,32188942,"MaxQuant score",206.6200000,0.9990640,,,,0,
LPFFHGNSISAPVTPPLAR,ph,S,149,true,"TOR Kinase and ABA Receptor",100,29290610,XCorr,3.7689362,0.9839000,,,,5.0760001613526E-5,
LPFFHGNSISAPVTPPLAR,ph,S,149,true,"Col-0 callus - FC Col-0 vs. Col-0 Xray",111a,31410901,,33.0200000,,2.1944713,0.0276473,YES,,0.6390188
LPFFHGNSISAPVTPPLAR,ph,S,149,true,"Col-0 X-ray callus - FC Col-0 vs. Col-0 Xray",111b,31410901,,33.0200000,,2.1944713,0.0276473,YES,,0.6390188
LPFFHGNSISAPVTPPLAR,ph,S,149,true,"atm callus - FC atm vs. atm Xray",111c,31410901,,33.0200000,,3.0805276,0.2003573,NO,,0.6390188
LPFFHGNSISAPVTPPLAR,ph,S,149,true,"atm-3 X-ray callus - FC atm vs. atm Xray",111d,31410901,,33.0200000,,3.0805276,0.2003573,NO,,0.6390188
NLSSNSPSKLPFFHGNSISAPVTPPLAR,ph,T,153,true,"Tissue atlas Arabidopsis - ProteomicsDB",114,32188942,"MaxQuant score",178.1700000,1.0000000,,,,0,
LPFFHGNSISAPVTPPLAR,ph,T,153,true,"TOR Kinase and ABA Receptor",100,29290610,XCorr,3.3067386,0.9991000,,,,0.0046029998920858,
LPFFHGNSISAPVTPPLAR,ph,T,153,true,"Col-0 callus - FC Col-0 vs. Col-0 Xray",111a,31410901,,33.0200000,,2.1944713,0.0276473,YES,,0.6390188
LPFFHGNSISAPVTPPLAR,ph,T,153,true,"Col-0 X-ray callus - FC Col-0 vs. Col-0 Xray",111b,31410901,,33.0200000,,2.1944713,0.0276473,YES,,0.6390188
LPFFHGNSISAPVTPPLAR,ph,T,153,true,"atm callus - FC atm vs. atm Xray",111c,31410901,,33.0200000,,3.0805276,0.2003573,NO,,0.6390188
LPFFHGNSISAPVTPPLAR,ph,T,153,true,"atm-3 X-ray callus - FC atm vs. atm Xray",111d,31410901,,33.0200000,,3.0805276,0.2003573,NO,,0.6390188
