Peptide,PTM,ModifiedAA,ModifiedPosition,PeptideUniqueToGene,ExperimentDesc,ExpID,PubmedID,ScoreType,IdentScore,LocProb,Log2FChange,PQ-val,QuantSig,PEP,MassErrorPPM
DVPNVHCVTDEDSHNGR,ph,S,63,true,"Tissue atlas Arabidopsis - ProteomicsDB",114,32188942,"MaxQuant score",129.9000000,0.9999920,,,,2.2009699618408E-10,
GSEADHGNNISDGGVSVR,ph,S,84,true,"Tissue atlas Arabidopsis - ProteomicsDB",114,32188942,"MaxQuant score",67.6440000,0.9987270,,,,0.00010473799920874,
ESVYDQSPSCNNNALHR,ph,S,191,true,"Tissue atlas Arabidopsis - ProteomicsDB",114,32188942,"MaxQuant score",130.5600000,0.9905150,,,,1.9783399918261E-10,
RVFSSNATLGFK,ph,S,283,true,"atm and atr DNA damage response",88,25561503,"MASCOT Score",34.0000000,0.9510000,,,,,-0.4200000
VFSSNATLGFK,ph,S,283,true,"srk2dei ABA signaling phopshoproteomics",83,23572148,"MASCOT Score",25.0000000,,,,,,0.0002000
VFSSNATLGFK,ph,S,283,true,"atm and atr DNA damage response",88,25561503,"MASCOT Score",70.0000000,0.9540000,,,,,0.1300000
VFSSNATLGFK,ph,S,283,true,"TOR Kinase and ABA Receptor",100,29290610,XCorr,3.8081841,0.9989000,,,,0.00010070000280393,
VFSSNATLGFK,ph,S,283,true,"Tissue atlas Arabidopsis - ProteomicsDB",114,32188942,"MaxQuant score",221.2400000,0.9994870,,,,1.891950509922E-39,
SRSFETLNLSWNDIK,ph,S,314,true,"Tissue atlas Arabidopsis - ProteomicsDB",114,32188942,"MaxQuant score",185.9600000,0.9672520,,,,3.6528899399932E-25,
