Peptide,PTM,ModifiedAA,ModifiedPosition,PeptideUniqueToGene,ExperimentDesc,ExpID,PubmedID,ScoreType,IdentScore,LocProb,Log2FChange,PQ-val,QuantSig,PEP,MassErrorPPM
SYSNLLDLASGNFHSFSR,ph,S,5,true,"Arabidopsis root NAA phosphoproteome",18a,27643528,"MaxQuant Score",61.5370000,0.7850000,,,,1.1449999874458E-5,0.0520000
SYSNLLDLASGNFHSFSR,ph,S,5,true,"MAPK Arabidopsis substrates",45,23172892,"MaxQuant Score",165.6600000,,,,,,
SYSNLLDLASGNFHSFSR,ph,S,5,true,"TOR Kinase and ABA Receptor",100,29290610,XCorr,5.2277703,0.9105000,,,,4.3860000005225E-6,
SYSNLLDLASGNFHSFSR,ph,S,5,true,"Tissue atlas Arabidopsis - ProteomicsDB",114,32188942,"MaxQuant score",401.6800000,0.9999830,,,,0,
SYSNLLDLASGNFHSFSR,ph,S,7,true,"Tissue atlas Arabidopsis - ProteomicsDB",114,32188942,"MaxQuant score",195.9700000,0.9168020,,,,2.8025969286496E-45,
VATVTGVLSELDDDNNSNSVCSDAPSSVTQDR,ph,T,32,true,"TOR Kinase and ABA Receptor",100,29290610,XCorr,4.7073126,0.8452000,,,,3.446999926382E-6,
YYHGFCK,so,C,150,false,"Arabidopsis S-sulfenylation chemoproteomics",108,31578252,"pFind PSM Score",0.0833314,,1.2404900,,,,-0.9007678
ACGDHVR,sno,C,548,true,"hot5-4 / wildtype, FAT-switch S-nitrosoproteome",169,37277371,,,,0.1793506,0.7046587,NO,,
VVALDPSFKK,ph,S,573,true,"atm and atr DNA damage response",88,25561503,"MASCOT Score",30.0000000,1.0000000,,,,,-2.0100000
VVALDPSFKK,ph,S,573,true,"Tissue atlas Arabidopsis - ProteomicsDB",114,32188942,"MaxQuant score",119.4500000,1.0000000,,,,0.00029964200803079,
