Peptide,PTM,ModifiedAA,ModifiedPosition,PeptideUniqueToGene,ExperimentDesc,ExpID,PubmedID,ScoreType,IdentScore,LocProb,Log2FChange,PQ-val,QuantSig,PEP,MassErrorPPM
AIYYKFKSAR,nta,A,2,false,"Arabidopsis translation initiation landscape - NTA",167a,35069635,,,,,,,,
SVGEFPPELK,ph,S,278,true,"Tissue atlas Arabidopsis - ProteomicsDB",114,32188942,"MaxQuant score",138.6300000,1.0000000,,,,9.2203699750826E-6,
ILESGNSSAENAGSMCQVQDMESVR,ph,S,355,true,"Conserved plant phosphoproteome - Arabidopsis",61a,20466843,"MASCOT Score",36.0000000,1.0000000,,,,,
ALSPTTSAASGGEK,ph,S,381,true,"atm and atr DNA damage response",88,25561503,"MASCOT Score",48.0000000,0.9910000,,,,,-0.5100000
ALSPTTSAASGGEK,ph,S,381,true,"Tissue atlas Arabidopsis - ProteomicsDB",114,32188942,"MaxQuant score",145.3600000,0.9999500,,,,4.6873699943717E-7,
ALSPTTSAASGGEK,ph,T,383,true,"atm and atr DNA damage response",88,25561503,"MASCOT Score",48.0000000,0.9830000,,,,,-0.5100000
ALSPTTSAASGGEK,ph,S,385,true,"atm and atr DNA damage response",88,25561503,"MASCOT Score",33.0000000,0.9930000,,,,,0.0800000
ALSPTTSAASGGEK,ph,S,385,true,"Tissue atlas Arabidopsis - ProteomicsDB",114,32188942,"MaxQuant score",96.1530000,0.9007330,,,,0.00043609499698505,
ALSPTTSAASGGEK,ph,S,388,true,"atm and atr DNA damage response",88,25561503,"MASCOT Score",48.0000000,1.0000000,,,,,-0.5100000
ALSPTTSAASGGEK,ph,S,388,true,"Tissue atlas Arabidopsis - ProteomicsDB",114,32188942,"MaxQuant score",145.3600000,0.9997280,,,,4.6873699943717E-7,
VEKPVDASANIQGSSNGK,ph,S,433,true,"Tissue atlas Arabidopsis - ProteomicsDB",114,32188942,"MaxQuant score",134.3800000,0.9937610,,,,2.7237899571453E-14,
VEKPVDASANIQGSSNGK,ph,S,440,true,"Tissue atlas Arabidopsis - ProteomicsDB",114,32188942,"MaxQuant score",203.5800000,0.9369390,,,,0,
EAAVSQLNTQPPKEEMPQQVASGEQGK,ph,S,465,true,"Tissue atlas Arabidopsis - ProteomicsDB",114,32188942,"MaxQuant score",233.0700000,1.0000000,,,,0,
IMNNSAVTSSPVKPK,ph,S,634,true,"atm and atr DNA damage response",88,25561503,"MASCOT Score",36.0000000,0.9850000,,,,,-1.5600000
IMNNSAVTSSPVKPK,ph,S,634,true,"Phospho cell culture sucrose/TOR",109,30833711,,,0.8294770,,,,,
IMNNSAVTSSPVKPK,ph,S,634,true,"Tissue atlas Arabidopsis - ProteomicsDB",114,32188942,"MaxQuant score",308.2900000,0.9720050,,,,0,
RFTSPPR,ph,S,673,true,"Tissue atlas Arabidopsis - ProteomicsDB",114,32188942,"MaxQuant score",118.8100000,0.9532570,,,,0.015949999913573,
SEKSSSDPTVEIDDNNK,ph,S,716,true,"Tissue atlas Arabidopsis - ProteomicsDB",114,32188942,"MaxQuant score",158.4800000,0.9610450,,,,4.6609401408899E-16,
SSSDPTVEIDDNNK,ph,S,717,true,"Tissue atlas Arabidopsis - ProteomicsDB",114,32188942,"MaxQuant score",203.7600000,0.9997330,,,,5.0811082316418E-42,
ISFPEESSGKQR,ph,S,741,true,"Tissue atlas Arabidopsis - ProteomicsDB",114,32188942,"MaxQuant score",105.5600000,0.8331360,,,,0.00027700100326911,
TSKSSPAPPESSVAPVSSGR,ph,S,752,true,"Tissue atlas Arabidopsis - ProteomicsDB",114,32188942,"MaxQuant score",185.6300000,0.9785990,,,,4.8370400114868E-30,
SSPAPPESSVAPVSSGR,ph,S,752,true,"Tyrosine phosphorylation in Arabidopsis",59,18463617,"MASCOT Score",38.0000000,,,,,,-1.1829040
SSPAPPESSVAPVSSGR,ph,S,752,true,"atm and atr DNA damage response",88,25561503,"MASCOT Score",65.0000000,0.9390000,,,,,0.1400000
EMVEYDSSDDEDRHFK,ph,S,782,true,"atm and atr DNA damage response",88,25561503,"MASCOT Score",27.0000000,0.9960000,,,,,-0.4500000
EMVEYDSSDDEDR,ph,S,782,true,"atm and atr DNA damage response",88,25561503,"MASCOT Score",59.0000000,1.0000000,,,,,-0.1800000
EMVEYDSSDDEDRHFK,ph,S,783,true,"atm and atr DNA damage response",88,25561503,"MASCOT Score",27.0000000,0.9960000,,,,,-0.4500000
EMVEYDSSDDEDR,ph,S,783,true,"atm and atr DNA damage response",88,25561503,"MASCOT Score",59.0000000,1.0000000,,,,,-0.1800000
YKRSPSVAPSDAGDEHFR,ph,Y,797,true,"TOR Kinase and ABA Receptor",100,29290610,XCorr,3.9827867,0.9923000,,,,1.6600000890321E-5,
YKRSPSVAPSDAGDEHFR,ph,Y,797,true,"Tissue atlas Arabidopsis - ProteomicsDB",114,32188942,"MaxQuant score",84.5810000,0.8949800,,,,0.00107170001138,
YKRSPSVAPSDAGDEHFR,ph,S,800,true,"atm and atr DNA damage response",88,25561503,"MASCOT Score",25.0000000,0.9990000,,,,,-0.1900000
YKRSPSVAPSDAGDEHFR,ph,S,800,true,"TOR Kinase and ABA Receptor",100,29290610,XCorr,3.9827867,0.9923000,,,,1.6600000890321E-5,
RSPSVAPSDAGDEHFR,ph,S,800,true,"atm and atr DNA damage response",88,25561503,"MASCOT Score",38.0000000,1.0000000,,,,,0.0300000
RSPSVAPSDAGDEHFR,ph,S,800,true,"TOR Kinase and ABA Receptor",100,29290610,XCorr,4.5634384,1.0000000,,,,6.1590000655087E-8,
RSPSVAPSDAGDEHFR,ph,S,800,true,"Phospho cell culture sucrose/TOR",109,30833711,,,0.9988150,,,,,
SPSVAPSDAGDEHFR,ph,S,800,true,"Tyrosine phosphorylation in Arabidopsis",59,18463617,"MASCOT Score",36.0000000,,,,,,-1.4539594
SPSVAPSDAGDEHFR,ph,S,800,true,"atm and atr DNA damage response",88,25561503,"MASCOT Score",69.0000000,0.9980000,,,,,-0.3700000
SPSVAPSDAGDEHFR,ph,S,800,true,"Tissue atlas Arabidopsis - ProteomicsDB",114,32188942,"MaxQuant score",202.9200000,1.0000000,,,,5.6051938572993E-45,
YKRSPSVAPSDAGDEHFR,ph,S,802,true,"atm and atr DNA damage response",88,25561503,"MASCOT Score",25.0000000,1.0000000,,,,,-0.1900000
RSPSVAPSDAGDEHFR,ph,S,802,true,"atm and atr DNA damage response",88,25561503,"MASCOT Score",38.0000000,1.0000000,,,,,0.0300000
RSPSVAPSDAGDEHFR,ph,S,802,true,"TOR Kinase and ABA Receptor",100,29290610,XCorr,4.5634384,1.0000000,,,,6.1590000655087E-8,
SPSVAPSDAGDEHFR,ph,S,802,true,"atm and atr DNA damage response",88,25561503,"MASCOT Score",53.0000000,1.0000000,,,,,-0.3300000
SPSVAPSDAGDEHFR,ph,S,802,true,"Tissue atlas Arabidopsis - ProteomicsDB",114,32188942,"MaxQuant score",169.6000000,1.0000000,,,,1.1137300423212E-27,
SPSVAPSDAGDEHFR,ph,S,806,true,"atm and atr DNA damage response",88,25561503,"MASCOT Score",41.0000000,1.0000000,,,,,0.5400000
