Peptide,PTM,ModifiedAA,ModifiedPosition,PeptideUniqueToGene,ExperimentDesc,ExpID,PubmedID,ScoreType,IdentScore,LocProb,Log2FChange,PQ-val,QuantSig,PEP,MassErrorPPM
SQANESSNAVQPLQK,ph,S,274,true,"Tissue atlas Arabidopsis - ProteomicsDB",114,32188942,"MaxQuant score",94.4500000,0.7726920,,,,4.2873100028373E-5,
SFIQSSEMLPSFEDAESRSPER,ph,S,1047,true,"Tissue atlas Arabidopsis - ProteomicsDB",114,32188942,"MaxQuant score",210.2200000,0.7577660,,,,0,
SPERLDPTSSEGEEK,ph,S,1049,true,"Tissue atlas Arabidopsis - ProteomicsDB",114,32188942,"MaxQuant score",208.2800000,0.9999950,,,,0,
LDPTSSEGEEK,ph,S,1057,true,"Tissue atlas Arabidopsis - ProteomicsDB",114,32188942,"MaxQuant score",94.1910000,0.8195420,,,,0.00017425499390811,
LDPTSSEGEEK,ph,S,1058,true,"atm and atr DNA damage response",88,25561503,"MASCOT Score",46.0000000,0.9980000,,,,,-0.6300000
LDPTSSEGEEK,ph,S,1058,true,"Phospho cell culture sucrose/TOR",109,30833711,,,0.7914190,,,,,
LDPTSSEGEEK,ph,S,1058,true,"Tissue atlas Arabidopsis - ProteomicsDB",114,32188942,"MaxQuant score",140.0100000,0.9612160,,,,8.0230199728248E-7,
KEDPVSQSPSTTTER,ph,S,1828,true,"atm and atr DNA damage response",88,25561503,"MASCOT Score",44.0000000,1.0000000,,,,,-0.5200000
KEDPVSQSPSTTTER,ph,S,1830,true,"atm and atr DNA damage response",88,25561503,"MASCOT Score",44.0000000,0.9930000,,,,,-0.5200000
KEDPVSQSPSTTTER,ph,S,1830,true,"Tissue atlas Arabidopsis - ProteomicsDB",114,32188942,"MaxQuant score",160.6400000,0.9781590,,,,1.4521100251061E-12,
EDPVSQSPSTTTER,ph,S,1830,true,"TOR Kinase and ABA Receptor",100,29290610,XCorr,3.0339246,0.8882000,,,,0.018850000575185,
VVIKNDEIK,ac,K,1885,true,"Quantitative Acetylproteomics",101,29440448,,,,,,,,
TTPDDIIQPTRPQPLNSVNSGHR,ph,S,2183,true,"Tissue atlas Arabidopsis - ProteomicsDB",114,32188942,"MaxQuant score",184.3000000,0.8914140,,,,0,
TTPDDIIQPTRPQPLNSVNSGHR,ph,S,2186,true,"Tissue atlas Arabidopsis - ProteomicsDB",114,32188942,"MaxQuant score",165.1700000,0.9997140,,,,5.0168166580986E-40,
LSPNQTSPVESELR,ph,S,2618,true,"atm and atr DNA damage response",88,25561503,"MASCOT Score",54.0000000,0.9450000,,,,,0.3300000
LSPNQTSPVESELR,ph,S,2618,true,"Tissue atlas Arabidopsis - ProteomicsDB",114,32188942,"MaxQuant score",213.8300000,0.9985380,,,,0,
STVKSISVR,ac,K,3316,true,"Quantitative Acetylproteomics",101,29440448,,,,,,,,
FTDDDSTSQSSNEIISLTSIGNHGYSTPQTPTEHK,ph,S,3417,true,"Tissue atlas Arabidopsis - ProteomicsDB",114,32188942,"MaxQuant score",134.4900000,0.7651060,,,,0,
HVYFAWNEADGRDSK,ph,S,3990,true,"TOR Kinase and ABA Receptor",100,29290610,XCorr,3.4695027,1.0000000,,,,0.013580000028014,
HVYFAWNEADGRDSK,ph,S,3990,true,"Tissue atlas Arabidopsis - ProteomicsDB",114,32188942,"MaxQuant score",159.0600000,1.0000000,,,,6.4523500474881E-13,
ELSSSSSVSDDKK,ph,S,4005,true,"atm and atr DNA damage response",88,25561503,"MASCOT Score",30.0000000,0.8870000,,,,,-1.7800000
ELSSSSSVSDDKK,ph,S,4005,true,"Tissue atlas Arabidopsis - ProteomicsDB",114,32188942,"MaxQuant score",153.8500000,0.9973160,,,,7.3167898606216E-13,
ELSSSSSVSDDKK,ph,S,4006,true,"Tissue atlas Arabidopsis - ProteomicsDB",114,32188942,"MaxQuant score",172.5700000,0.9109020,,,,2.4880800849789E-15,
ELSSSSSVSDDKK,ph,S,4007,true,"Tissue atlas Arabidopsis - ProteomicsDB",114,32188942,"MaxQuant score",198.2900000,0.9991080,,,,6.8782199359269E-31,
ELSSSSSVSDDKK,ph,S,4008,true,"atm and atr DNA damage response",88,25561503,"MASCOT Score",61.0000000,0.9020000,,,,,-1.1200000
ELSSSSSVSDDKK,ph,S,4008,true,"Tissue atlas Arabidopsis - ProteomicsDB",114,32188942,"MaxQuant score",163.9900000,0.8367830,,,,1.0343999962137E-10,
SRELSSSSSVSDDK,ph,S,4009,true,"TOR Kinase and ABA Receptor",100,29290610,XCorr,4.1917992,0.8274000,,,,1.3199999557401E-5,
ELSSSSSVSDDKK,ph,S,4009,true,"Tissue atlas Arabidopsis - ProteomicsDB",114,32188942,"MaxQuant score",211.5100000,0.9959770,,,,1.3461895996183E-39,
SRELSSSSSVSDDKK,ph,S,4011,true,"TOR Kinase and ABA Receptor",100,29290610,XCorr,3.1482465,0.8720000,,,,1.0869999641727E-5,
ELSSSSSVSDDKK,ph,S,4011,true,"Tissue atlas Arabidopsis - ProteomicsDB",114,32188942,"MaxQuant score",217.0100000,0.9987850,,,,0,
SIESESGKNLR,ph,S,4209,true,"Tissue atlas Arabidopsis - ProteomicsDB",114,32188942,"MaxQuant score",146.0700000,0.9998760,,,,6.6197898718201E-8,
