Peptide,PTM,ModifiedAA,ModifiedPosition,PeptideUniqueToGene,ExperimentDesc,ExpID,PubmedID,ScoreType,IdentScore,LocProb,Log2FChange,PQ-val,QuantSig,PEP,MassErrorPPM
LDQMVIPIFYK,ph,Y,102,true,"Tissue atlas Arabidopsis - ProteomicsDB",114,32188942,"MaxQuant score",66.5680000,1.0000000,,,,0.010193400084972,
IEECGAVEQR,ox,C,271,true,"SPEAR - 50 mM H2O2 / mock",138b,34619326,,,,3.2371985,0.0146601,YES,,
YAFGKNSPPHGFNELADEAAK,ph,S,354,true,"Tissue atlas Arabidopsis - ProteomicsDB",114,32188942,"MaxQuant score",192.5000000,1.0000000,,,,0,
NMDASPGGNK,ph,S,516,true,"atm and atr DNA damage response",88,25561503,"MASCOT Score",55.0000000,1.0000000,,,,,-0.8600000
TSNQSTKDSPR,ph,S,530,true,"atm and atr DNA damage response",88,25561503,"MASCOT Score",43.0000000,0.9960000,,,,,-0.1200000
SIDGGDKFEGK,ph,S,601,true,"Tissue atlas Arabidopsis - ProteomicsDB",114,32188942,"MaxQuant score",86.5920000,1.0000000,,,,0.0011546299792826,
SKVSDGGLDGK,ph,S,615,true,"atm and atr DNA damage response",88,25561503,"MASCOT Score",41.0000000,1.0000000,,,,,-1.0100000
SKVSDGGLDGK,ph,S,615,true,"Tissue atlas Arabidopsis - ProteomicsDB",114,32188942,"MaxQuant score",77.4200000,0.9998210,,,,0.0030147600919008,
