Peptide,PTM,ModifiedAA,ModifiedPosition,PeptideUniqueToGene,ExperimentDesc,ExpID,PubmedID,ScoreType,IdentScore,LocProb,Log2FChange,PQ-val,QuantSig,PEP,MassErrorPPM
ATLNPFDLLDDDAEDPSQLAVAIEK,nta,A,2,true,"Characterization plant N-terminal acetylation",6,22223895,"MASCOT Score",74.6400000,,,,,,
SGQVSSLPAK,ph,S,33,true,"Tissue atlas Arabidopsis - ProteomicsDB",114,32188942,"MaxQuant score",116.2400000,0.9999780,,,,0.00017954000213649,
KSGQVSSLPAK,ph,S,37,true,"Tissue atlas Arabidopsis - ProteomicsDB",114,32188942,"MaxQuant score",78.6150000,0.7674960,,,,0.0011097199749202,
LPSKPLPPAQAVR,ph,S,49,true,"Tissue atlas Arabidopsis - ProteomicsDB",114,32188942,"MaxQuant score",73.8770000,1.0000000,,,,0.00079628801904619,
SDAPRGGGGRGGFNR,me2,R,67,true,"Arabidopsis protein methylome",123,31809900,"MaxQuant Score",86.5780000,1.0000000,,,,1.6959100790359E-8,1.4351000
SDAPRGGGGRGGFNR,me2,R,72,true,"Arabidopsis protein methylome",123,31809900,"MaxQuant Score",86.5780000,1.0000000,,,,1.6959100790359E-8,1.4351000
GSFRGEGGGPGGGR,ph,S,121,true,"Tissue atlas Arabidopsis - ProteomicsDB",114,32188942,"MaxQuant score",44.9980000,1.0000000,,,,0.0068215602077544,
RGGFSNEGGDGERPR,me1,R,134,true,"Arabidopsis protein methylome",123,31809900,"MaxQuant Score",194.0000000,1.0000000,,,,0,0.9259800
SGTGRGSDFK,me1,R,159,true,"Arabidopsis protein methylome",123,31809900,"MaxQuant Score",69.6720000,1.0000000,,,,0.0005253300187178,0.1526700
SGTGRGSDFK,me2,R,159,true,"Arabidopsis protein methylome",123,31809900,"MaxQuant Score",63.6240000,1.0000000,,,,0.005473009776324,0.1733900
DGSGRGNWGTPGEEIAAETEAVAGVETEK,me1,R,170,true,"Arabidopsis protein methylome",123,31809900,"MaxQuant Score",116.2400000,1.0000000,,,,0,-0.3271800
EMTLDEYEK,mox,M,226,true,"cat2 Methionine oxidation - 3h stress",62b,25693801,"MASCOT Score",50.0000000,,-0.0014269,,NO,,
ALQSLTTSER,ph,T,246,true,"Tissue atlas Arabidopsis - ProteomicsDB",114,32188942,"MaxQuant score",103.4300000,0.7737340,,,,0.00092471000971273,
ALQSLTTSER,ph,S,248,true,"Tissue atlas Arabidopsis - ProteomicsDB",114,32188942,"MaxQuant score",122.5500000,0.9350290,,,,0.00011990899656666,
VFESMQQLSNKK,ph,S,259,false,"Tissue atlas Arabidopsis - ProteomicsDB",114,32188942,"MaxQuant score",188.9600000,1.0000000,,,,5.5732800305763E-21,
VFESMQQLSNKK,mox,M,260,false,"cat2 Methionine oxidation - 1h stress",62a,25693801,"MASCOT Score",59.0000000,,-0.7314164,,NO,,
VFESMQQLSNKK,ph,S,264,false,"Tissue atlas Arabidopsis - ProteomicsDB",114,32188942,"MaxQuant score",250.5300000,1.0000000,,,,0,
KSNDEIFIK,ph,S,268,true,"atm and atr DNA damage response",88,25561503,"MASCOT Score",39.0000000,1.0000000,,,,,-2.2000000
SNDEIFIK,ph,S,268,true,"srk2dei ABA signaling phopshoproteomics",83,23572148,"MASCOT Score",36.0000000,,,,,,-0.0006000
SNDEIFIK,ph,S,268,true,"Tissue atlas Arabidopsis - ProteomicsDB",114,32188942,"MaxQuant score",137.2400000,1.0000000,,,,9.6880600993593E-22,
PAEGGNYYRGGR,me1,R,311,true,"Arabidopsis protein methylome",123,31809900,"MaxQuant Score",124.2000000,1.0000000,,,,0,1.1743000
NEAAPAIGDAAQFPSLGGK,ph,S,351,true,"STN8 phosphoproteome",38,21768351,"MASCOT Score",61.0000000,,,,,,-0.0144507
NEAAPAIGDAAQFPSLGGK,ph,S,351,true,"Pollen phosphoproteome Arabidopsis",43,22631563,"MASCOT Score",72.6400000,,,,,,-1.2388000
NEAAPAIGDAAQFPSLGGK,ph,S,351,true,"Chloroplast kinase substrates",60,19376835,"MASCOT Score",71.6400000,,,,,,-1.0910400
NEAAPAIGDAAQFPSLGGK,ph,S,351,true,"atm and atr DNA damage response",88,25561503,"MASCOT Score",45.0000000,1.0000000,,,,,0.1700000
NEAAPAIGDAAQFPSLGGK,ph,S,351,true,"Lateral root-induction - NAA vs control",106,23328941,"MASCOT Score",50.0000000,,,,,,
NEAAPAIGDAAQFPSLGGK,ph,S,351,true,"Tissue atlas Arabidopsis - ProteomicsDB",114,32188942,"MaxQuant score",296.8100000,1.0000000,,,,0,
NEAAPAIGDAAQFPSLGGK,ub,K,355,true,"Arabidopsis ubiquitination COFRADIC",40,26744219,"MaxQuant Score",173.7300000,1.0000000,,,,0,1.6380000
